Argonne National Laboratory

Experimental Physics and
Industrial Control System

2002  2003  2004  2005  2006  2007  2008  2009  2010  2011  2012  2013  2014  2015  2016  <2017 Index 2002  2003  2004  2005  2006  2007  2008  2009  2010  2011  2012  2013  2014  2015  2016  <2017
<== Date ==> <== Thread ==>

Subject: Build failed in Jenkins: epics-base-3.16-linux32-test #78
From: APS Jenkins <aps-jenkins@anl.gov>
To: core-talk@aps.anl.gov
Date: Tue, 23 May 2017 23:49:11 -0500 (CDT)
See <https://jenkins.aps.anl.gov/job/epics-base-3.16-linux32-test/78/display/redirect>

------------------------------------------
[...truncated 34.22 KB...]
	    T_A=linux-x86 test-results
make[3]: Entering directory `<https://jenkins.aps.anl.gov/job/epics-base-3.16-linux32-test/ws/src/template/base/O.linux-x86'>
make[3]: Nothing to be done for `test-results'.
make[3]: Leaving directory `<https://jenkins.aps.anl.gov/job/epics-base-3.16-linux32-test/ws/src/template/base/O.linux-x86'>
make[2]: Leaving directory `<https://jenkins.aps.anl.gov/job/epics-base-3.16-linux32-test/ws/src/template/base'>
make -C template/ext test-results 
make[2]: Entering directory `<https://jenkins.aps.anl.gov/job/epics-base-3.16-linux32-test/ws/src/template/ext'>
make -C O.linux-x86 -f ../Makefile TOP=../../../.. \
	    T_A=linux-x86 test-results
make[3]: Entering directory `<https://jenkins.aps.anl.gov/job/epics-base-3.16-linux32-test/ws/src/template/ext/O.linux-x86'>
make[3]: Nothing to be done for `test-results'.
make[3]: Leaving directory `<https://jenkins.aps.anl.gov/job/epics-base-3.16-linux32-test/ws/src/template/ext/O.linux-x86'>
make[2]: Leaving directory `<https://jenkins.aps.anl.gov/job/epics-base-3.16-linux32-test/ws/src/template/ext'>
make -C ./libCom test-results 
make[2]: Entering directory `<https://jenkins.aps.anl.gov/job/epics-base-3.16-linux32-test/ws/src/libCom'>
make -C O.linux-x86 -f ../Makefile TOP=../../.. \
	    T_A=linux-x86 test-results
make[3]: Entering directory `<https://jenkins.aps.anl.gov/job/epics-base-3.16-linux32-test/ws/src/libCom/O.linux-x86'>
make[3]: Nothing to be done for `test-results'.
make[3]: Leaving directory `<https://jenkins.aps.anl.gov/job/epics-base-3.16-linux32-test/ws/src/libCom/O.linux-x86'>
make[2]: Leaving directory `<https://jenkins.aps.anl.gov/job/epics-base-3.16-linux32-test/ws/src/libCom'>
make -C libCom/RTEMS test-results 
make[2]: Entering directory `<https://jenkins.aps.anl.gov/job/epics-base-3.16-linux32-test/ws/src/libCom/RTEMS'>
make -C O.linux-x86 -f ../Makefile TOP=../../../.. \
	    T_A=linux-x86 test-results
make[3]: Entering directory `<https://jenkins.aps.anl.gov/job/epics-base-3.16-linux32-test/ws/src/libCom/RTEMS/O.linux-x86'>
make[3]: Nothing to be done for `test-results'.
make[3]: Leaving directory `<https://jenkins.aps.anl.gov/job/epics-base-3.16-linux32-test/ws/src/libCom/RTEMS/O.linux-x86'>
make[2]: Leaving directory `<https://jenkins.aps.anl.gov/job/epics-base-3.16-linux32-test/ws/src/libCom/RTEMS'>
make -C libCom/test test-results 
make[2]: Entering directory `<https://jenkins.aps.anl.gov/job/epics-base-3.16-linux32-test/ws/src/libCom/test'>
make -C O.linux-x86 -f ../Makefile TOP=../../../.. \
	    T_A=linux-x86 test-results
make[3]: Entering directory `<https://jenkins.aps.anl.gov/job/epics-base-3.16-linux32-test/ws/src/libCom/test/O.linux-x86'>
prove --failures --ext .tap --exec cat --color epicsUnitTestTest.tap epicsTypesTest.tap epicsInlineTest.tap epicsCalcTest.tap epicsAlgorithmTest.tap epicsMathTest.tap epicsMMIOTest.tap epicsEllTest.tap epicsEnvTest.tap epicsErrlogTest.tap epicsStdioTest.tap epicsStdlibTest.tap epicsSockResolveTest.tap epicsStringTest.tap epicsTimeTest.tap epicsTimeZoneTest.tap epicsThreadTest.tap epicsThreadOnceTest.tap epicsThreadPriorityTest.tap epicsThreadPrivateTest.tap epicsThreadHooksTest.tap epicsThreadPoolTest.tap epicsExitTest.tap epicsTimerTest.tap ringPointerTest.tap ringBytesTest.tap epicsEventTest.tap epicsMutexTest.tap epicsSpinTest.tap epicsAtomicTest.tap macDefExpandTest.tap cvtFastTest.tap macLibTest.tap taskwdTest.tap blockingSockTest.tap epicsMessageQueueTest.tap epicsStackTraceTest.tap ipAddrToAsciiTest.tap
epicsUnitTestTest.tap ........ ok
epicsTypesTest.tap ........... ok
epicsInlineTest.tap .......... ok
epicsCalcTest.tap ............ ok
epicsAlgorithmTest.tap ....... ok
epicsMathTest.tap ............ ok
epicsMMIOTest.tap ............ ok
epicsEllTest.tap ............. ok
epicsEnvTest.tap ............. ok
epicsErrlogTest.tap .......... ok
epicsStdioTest.tap ........... ok
epicsStdlibTest.tap .......... ok
epicsSockResolveTest.tap ..... ok
epicsStringTest.tap .......... ok
epicsTimeTest.tap ............ ok
epicsTimeZoneTest.tap ........ ok
epicsThreadTest.tap .......... ok
epicsThreadOnceTest.tap ...... ok
epicsThreadPriorityTest.tap .. ok
epicsThreadPrivateTest.tap ... ok
epicsThreadHooksTest.tap ..... ok
epicsThreadPoolTest.tap ...... ok
epicsExitTest.tap ............ ok
epicsTimerTest.tap ........... ok
ringPointerTest.tap .......... ok
ringBytesTest.tap ............ ok
epicsEventTest.tap ........... ok
epicsMutexTest.tap ........... ok
epicsSpinTest.tap ............ ok
epicsAtomicTest.tap .......... ok
macDefExpandTest.tap ......... ok
cvtFastTest.tap .............. ok
macLibTest.tap ............... ok
taskwdTest.tap ............... ok
blockingSockTest.tap ......... ok
epicsMessageQueueTest.tap .... ok
epicsStackTraceTest.tap ...... ok
ipAddrToAsciiTest.tap ........ ok
All tests successful.
Files=38, Tests=3964,  1 wallclock secs ( 0.91 usr  0.13 sys +  0.03 cusr  0.08 csys =  1.15 CPU)
Result: PASS
make[3]: Leaving directory `<https://jenkins.aps.anl.gov/job/epics-base-3.16-linux32-test/ws/src/libCom/test/O.linux-x86'>
make[2]: Leaving directory `<https://jenkins.aps.anl.gov/job/epics-base-3.16-linux32-test/ws/src/libCom/test'>
make -C ca/client test-results 
make[2]: Entering directory `<https://jenkins.aps.anl.gov/job/epics-base-3.16-linux32-test/ws/src/ca/client'>
make -C O.linux-x86 -f ../Makefile TOP=../../../.. \
	    T_A=linux-x86 test-results
make[3]: Entering directory `<https://jenkins.aps.anl.gov/job/epics-base-3.16-linux32-test/ws/src/ca/client/O.linux-x86'>
make[3]: Nothing to be done for `test-results'.
make[3]: Leaving directory `<https://jenkins.aps.anl.gov/job/epics-base-3.16-linux32-test/ws/src/ca/client/O.linux-x86'>
make[2]: Leaving directory `<https://jenkins.aps.anl.gov/job/epics-base-3.16-linux32-test/ws/src/ca/client'>
make -C ca/client/tools test-results 
make[2]: Entering directory `<https://jenkins.aps.anl.gov/job/epics-base-3.16-linux32-test/ws/src/ca/client/tools'>
make -C O.linux-x86 -f ../Makefile TOP=../../../../.. \
	    T_A=linux-x86 test-results
make[3]: Entering directory `<https://jenkins.aps.anl.gov/job/epics-base-3.16-linux32-test/ws/src/ca/client/tools/O.linux-x86'>
make[3]: Nothing to be done for `test-results'.
make[3]: Leaving directory `<https://jenkins.aps.anl.gov/job/epics-base-3.16-linux32-test/ws/src/ca/client/tools/O.linux-x86'>
make[2]: Leaving directory `<https://jenkins.aps.anl.gov/job/epics-base-3.16-linux32-test/ws/src/ca/client/tools'>
make -C ca/legacy/gdd test-results 
make[2]: Entering directory `<https://jenkins.aps.anl.gov/job/epics-base-3.16-linux32-test/ws/src/ca/legacy/gdd'>
make -C O.linux-x86 -f ../Makefile TOP=../../../../.. \
	    T_A=linux-x86 test-results
make[3]: Entering directory `<https://jenkins.aps.anl.gov/job/epics-base-3.16-linux32-test/ws/src/ca/legacy/gdd/O.linux-x86'>
make[3]: Nothing to be done for `test-results'.
make[3]: Leaving directory `<https://jenkins.aps.anl.gov/job/epics-base-3.16-linux32-test/ws/src/ca/legacy/gdd/O.linux-x86'>
make[2]: Leaving directory `<https://jenkins.aps.anl.gov/job/epics-base-3.16-linux32-test/ws/src/ca/legacy/gdd'>
make -C ca/legacy/pcas test-results 
make[2]: Entering directory `<https://jenkins.aps.anl.gov/job/epics-base-3.16-linux32-test/ws/src/ca/legacy/pcas'>
make -C ./build test-results 
make[3]: Entering directory `<https://jenkins.aps.anl.gov/job/epics-base-3.16-linux32-test/ws/src/ca/legacy/pcas/build'>
make -C O.linux-x86 -f ../Makefile TOP=../../../../../.. \
	    T_A=linux-x86 test-results
make[4]: Entering directory `<https://jenkins.aps.anl.gov/job/epics-base-3.16-linux32-test/ws/src/ca/legacy/pcas/build/O.linux-x86'>
make[4]: Nothing to be done for `test-results'.
make[4]: Leaving directory `<https://jenkins.aps.anl.gov/job/epics-base-3.16-linux32-test/ws/src/ca/legacy/pcas/build/O.linux-x86'>
make[3]: Leaving directory `<https://jenkins.aps.anl.gov/job/epics-base-3.16-linux32-test/ws/src/ca/legacy/pcas/build'>
make -C ./example test-results 
make[3]: Entering directory `<https://jenkins.aps.anl.gov/job/epics-base-3.16-linux32-test/ws/src/ca/legacy/pcas/example'>
make -C ./directoryService test-results 
make[4]: Entering directory `<https://jenkins.aps.anl.gov/job/epics-base-3.16-linux32-test/ws/src/ca/legacy/pcas/example/directoryService'>
make -C O.linux-x86 -f ../Makefile TOP=../../../../../../.. \
	    T_A=linux-x86 test-results
make[5]: Entering directory `<https://jenkins.aps.anl.gov/job/epics-base-3.16-linux32-test/ws/src/ca/legacy/pcas/example/directoryService/O.linux-x86'>
make[5]: Nothing to be done for `test-results'.
make[5]: Leaving directory `<https://jenkins.aps.anl.gov/job/epics-base-3.16-linux32-test/ws/src/ca/legacy/pcas/example/directoryService/O.linux-x86'>
make[4]: Leaving directory `<https://jenkins.aps.anl.gov/job/epics-base-3.16-linux32-test/ws/src/ca/legacy/pcas/example/directoryService'>
make[3]: Leaving directory `<https://jenkins.aps.anl.gov/job/epics-base-3.16-linux32-test/ws/src/ca/legacy/pcas/example'>
make[2]: Leaving directory `<https://jenkins.aps.anl.gov/job/epics-base-3.16-linux32-test/ws/src/ca/legacy/pcas'>
make -C ./ioc test-results 
make[2]: Entering directory `<https://jenkins.aps.anl.gov/job/epics-base-3.16-linux32-test/ws/src/ioc'>
make -C O.linux-x86 -f ../Makefile TOP=../../.. \
	    T_A=linux-x86 test-results
make[3]: Entering directory `<https://jenkins.aps.anl.gov/job/epics-base-3.16-linux32-test/ws/src/ioc/O.linux-x86'>
make[3]: Nothing to be done for `test-results'.
make[3]: Leaving directory `<https://jenkins.aps.anl.gov/job/epics-base-3.16-linux32-test/ws/src/ioc/O.linux-x86'>
make[2]: Leaving directory `<https://jenkins.aps.anl.gov/job/epics-base-3.16-linux32-test/ws/src/ioc'>
make -C ca/legacy/pcas/ex test-results 
make[2]: Entering directory `<https://jenkins.aps.anl.gov/job/epics-base-3.16-linux32-test/ws/src/ca/legacy/pcas/ex'>
make -C O.linux-x86 -f ../Makefile TOP=../../../../../.. \
	    T_A=linux-x86 test-results
make[3]: Entering directory `<https://jenkins.aps.anl.gov/job/epics-base-3.16-linux32-test/ws/src/ca/legacy/pcas/ex/O.linux-x86'>
make[3]: Nothing to be done for `test-results'.
make[3]: Leaving directory `<https://jenkins.aps.anl.gov/job/epics-base-3.16-linux32-test/ws/src/ca/legacy/pcas/ex/O.linux-x86'>
make[2]: Leaving directory `<https://jenkins.aps.anl.gov/job/epics-base-3.16-linux32-test/ws/src/ca/legacy/pcas/ex'>
make -C ca/client/perl test-results 
make[2]: Entering directory `<https://jenkins.aps.anl.gov/job/epics-base-3.16-linux32-test/ws/src/ca/client/perl'>
make -C O.linux-x86 -f ../Makefile TOP=../../../../.. \
	    T_A=linux-x86 test-results
make[3]: Entering directory `<https://jenkins.aps.anl.gov/job/epics-base-3.16-linux32-test/ws/src/ca/client/perl/O.linux-x86'>
make[3]: Nothing to be done for `test-results'.
make[3]: Leaving directory `<https://jenkins.aps.anl.gov/job/epics-base-3.16-linux32-test/ws/src/ca/client/perl/O.linux-x86'>
make[2]: Leaving directory `<https://jenkins.aps.anl.gov/job/epics-base-3.16-linux32-test/ws/src/ca/client/perl'>
make -C ioc/db/test test-results 
make[2]: Entering directory `<https://jenkins.aps.anl.gov/job/epics-base-3.16-linux32-test/ws/src/ioc/db/test'>
make -C O.linux-x86 -f ../Makefile TOP=../../../../.. \
	    T_A=linux-x86 test-results
make[3]: Entering directory `<https://jenkins.aps.anl.gov/job/epics-base-3.16-linux32-test/ws/src/ioc/db/test/O.linux-x86'>
prove --failures --ext .tap --exec cat --color dbScanTest.tap dbShutdownTest.tap dbPutLinkTest.tap dbLockTest.tap dbStressTest.tap testdbConvert.tap callbackTest.tap callbackParallelTest.tap dbStateTest.tap dbCaStatsTest.tap dbCaLinkTest.tap scanIoTest.tap dbChannelTest.tap dbChArrTest.tap chfPluginTest.tap arrShorthandTest.tap recGblCheckDeadbandTest.tap testPutGetTest.tap dbStaticTest.tap
dbScanTest.tap ............... ok
dbShutdownTest.tap ........... ok
dbPutLinkTest.tap ............ ok
dbLockTest.tap ............... ok
dbStressTest.tap ............. ok
testdbConvert.tap ............ ok
callbackTest.tap ............. ok
callbackParallelTest.tap ..... ok
dbStateTest.tap .............. ok
dbCaStatsTest.tap ............ ok
dbCaLinkTest.tap ............. ok
scanIoTest.tap ............... ok
dbChannelTest.tap ............ ok
dbChArrTest.tap .............. ok
chfPluginTest.tap ............ ok
arrShorthandTest.tap ......... ok
recGblCheckDeadbandTest.tap .. ok
testPutGetTest.tap ........... ok
dbStaticTest.tap ............. ok
All tests successful.
Files=19, Tests=2790,  1 wallclock secs ( 0.66 usr  0.07 sys +  0.00 cusr  0.04 csys =  0.77 CPU)
Result: PASS
make[3]: Leaving directory `<https://jenkins.aps.anl.gov/job/epics-base-3.16-linux32-test/ws/src/ioc/db/test/O.linux-x86'>
make[2]: Leaving directory `<https://jenkins.aps.anl.gov/job/epics-base-3.16-linux32-test/ws/src/ioc/db/test'>
make -C ioc/dbtemplate/test test-results 
make[2]: Entering directory `<https://jenkins.aps.anl.gov/job/epics-base-3.16-linux32-test/ws/src/ioc/dbtemplate/test'>
make -C O.linux-x86 -f ../Makefile TOP=../../../../.. \
	    T_A=linux-x86 test-results
make[3]: Entering directory `<https://jenkins.aps.anl.gov/job/epics-base-3.16-linux32-test/ws/src/ioc/dbtemplate/test/O.linux-x86'>
prove --failures --ext .tap --exec cat --color msi.tap
msi.tap .. ok
All tests successful.
Files=1, Tests=9,  0 wallclock secs ( 0.04 usr +  0.00 sys =  0.04 CPU)
Result: PASS
make[3]: Leaving directory `<https://jenkins.aps.anl.gov/job/epics-base-3.16-linux32-test/ws/src/ioc/dbtemplate/test/O.linux-x86'>
make[2]: Leaving directory `<https://jenkins.aps.anl.gov/job/epics-base-3.16-linux32-test/ws/src/ioc/dbtemplate/test'>
make -C ./std test-results 
make[2]: Entering directory `<https://jenkins.aps.anl.gov/job/epics-base-3.16-linux32-test/ws/src/std'>
make -C O.linux-x86 -f ../Makefile TOP=../../.. \
	    T_A=linux-x86 test-results
make[3]: Entering directory `<https://jenkins.aps.anl.gov/job/epics-base-3.16-linux32-test/ws/src/std/O.linux-x86'>
make[3]: Nothing to be done for `test-results'.
make[3]: Leaving directory `<https://jenkins.aps.anl.gov/job/epics-base-3.16-linux32-test/ws/src/std/O.linux-x86'>
make[2]: Leaving directory `<https://jenkins.aps.anl.gov/job/epics-base-3.16-linux32-test/ws/src/std'>
make -C std/filters/test test-results 
make[2]: Entering directory `<https://jenkins.aps.anl.gov/job/epics-base-3.16-linux32-test/ws/src/std/filters/test'>
make -C O.linux-x86 -f ../Makefile TOP=../../../../.. \
	    T_A=linux-x86 test-results
make[3]: Entering directory `<https://jenkins.aps.anl.gov/job/epics-base-3.16-linux32-test/ws/src/std/filters/test/O.linux-x86'>
prove --failures --ext .tap --exec cat --color tsTest.tap dbndTest.tap arrTest.tap syncTest.tap
tsTest.tap .... ok
dbndTest.tap .. ok
arrTest.tap ... ok
syncTest.tap .. ok
All tests successful.
Files=4, Tests=1612,  1 wallclock secs ( 0.38 usr +  0.02 sys =  0.40 CPU)
Result: PASS
make[3]: Leaving directory `<https://jenkins.aps.anl.gov/job/epics-base-3.16-linux32-test/ws/src/std/filters/test/O.linux-x86'>
make[2]: Leaving directory `<https://jenkins.aps.anl.gov/job/epics-base-3.16-linux32-test/ws/src/std/filters/test'>
make -C std/rec/test test-results 
make[2]: Entering directory `<https://jenkins.aps.anl.gov/job/epics-base-3.16-linux32-test/ws/src/std/rec/test'>
make -C O.linux-x86 -f ../Makefile TOP=../../../../.. \
	    T_A=linux-x86 test-results
make[3]: Entering directory `<https://jenkins.aps.anl.gov/job/epics-base-3.16-linux32-test/ws/src/std/rec/test/O.linux-x86'>
prove --failures --ext .tap --exec cat --color arrayOpTest.tap recMiscTest.tap linkRetargetLinkTest.tap linkInitTest.tap compressTest.tap asTest.tap analogMonitorTest.tap regressTest.tap
arrayOpTest.tap ........... ok
recMiscTest.tap ........... ok
linkRetargetLinkTest.tap .. ok
linkInitTest.tap .......... 
not ok 59 - dbGetField("i64i2", 7) -> 4294967297 == 1
Failed 1/72 subtests 
compressTest.tap .......... ok
asTest.tap ................ ok
analogMonitorTest.tap ..... ok
regressTest.tap ........... ok

Test Summary Report
-------------------
linkInitTest.tap        (Wstat: 0 Tests: 72 Failed: 1)
  Failed test:  59
Files=8, Tests=2077,  0 wallclock secs ( 0.45 usr  0.03 sys +  0.00 cusr  0.01 csys =  0.49 CPU)
Result: FAIL
make[3]: *** [test-results] Error 1
make[3]: Leaving directory `<https://jenkins.aps.anl.gov/job/epics-base-3.16-linux32-test/ws/src/std/rec/test/O.linux-x86'>
make[2]: *** [test-results.linux-x86] Error 2
make[2]: Leaving directory `<https://jenkins.aps.anl.gov/job/epics-base-3.16-linux32-test/ws/src/std/rec/test'>
make[1]: *** [std/rec/test.test-results] Error 2
make[1]: Leaving directory `<https://jenkins.aps.anl.gov/job/epics-base-3.16-linux32-test/ws/src'>
make: *** [src.test-results] Error 2
Build step 'Execute shell' marked build as failure
TAP Reports Processing: START
Looking for TAP results report in workspace using pattern: src/**/O.linux-x86/*.tap
Saving reports...
There are failed test cases. Marking build as UNSTABLE
TAP Reports Processing: FINISH

Replies:
Build failed in Jenkins: epics-base-3.16-linux32-test #79 APS Jenkins
References:
Build failed in Jenkins: epics-base-3.16-linux32-test #77 APS Jenkins

Navigate by Date:
Prev: Build failed in Jenkins: epics-base-3.16-linux32-test #77 APS Jenkins
Next: Jenkins build became unstable: epics-base-3.16-sol-test #80 APS Jenkins
Index: 2002  2003  2004  2005  2006  2007  2008  2009  2010  2011  2012  2013  2014  2015  2016  <2017
Navigate by Thread:
Prev: Build failed in Jenkins: epics-base-3.16-linux32-test #77 APS Jenkins
Next: Build failed in Jenkins: epics-base-3.16-linux32-test #79 APS Jenkins
Index: 2002  2003  2004  2005  2006  2007  2008  2009  2010  2011  2012  2013  2014  2015  2016  <2017
ANJ, 24 May 2017 Valid HTML 4.01! · Home · News · About · Base · Modules · Extensions · Distributions · Download ·
· EPICS V4 · IRMIS · Talk · Bugs · Documents · Links · Licensing ·