Argonne National Laboratory

Experimental Physics and
Industrial Control System

2002  2003  2004  2005  2006  2007  2008  2009  2010  2011  2012  2013  2014  2015  2016  <2017 Index 2002  2003  2004  2005  2006  2007  2008  2009  2010  2011  2012  2013  2014  2015  2016  <2017
<== Date ==> <== Thread ==>

Subject: Build failed in Jenkins: epics-base-3.16-linux32-test #79
From: APS Jenkins <aps-jenkins@anl.gov>
To: core-talk@aps.anl.gov
Date: Wed, 24 May 2017 00:00:11 -0500 (CDT)
See <https://jenkins.aps.anl.gov/job/epics-base-3.16-linux32-test/79/display/redirect>

------------------------------------------
[...truncated 8.20 KB...]
make[1]: Leaving directory `<https://jenkins.aps.anl.gov/job/epics-base-3.16-linux32-test/ws/src/ca/client/tools'>
make -C ca/legacy/gdd tapfiles 
make[1]: Entering directory `<https://jenkins.aps.anl.gov/job/epics-base-3.16-linux32-test/ws/src/ca/legacy/gdd'>
make -C O.linux-x86 -f ../Makefile TOP=../../../../.. \
	    T_A=linux-x86 tapfiles
make[2]: Entering directory `<https://jenkins.aps.anl.gov/job/epics-base-3.16-linux32-test/ws/src/ca/legacy/gdd/O.linux-x86'>
make[2]: Nothing to be done for `tapfiles'.
make[2]: Leaving directory `<https://jenkins.aps.anl.gov/job/epics-base-3.16-linux32-test/ws/src/ca/legacy/gdd/O.linux-x86'>
make[1]: Leaving directory `<https://jenkins.aps.anl.gov/job/epics-base-3.16-linux32-test/ws/src/ca/legacy/gdd'>
make -C ca/legacy/pcas tapfiles 
make[1]: Entering directory `<https://jenkins.aps.anl.gov/job/epics-base-3.16-linux32-test/ws/src/ca/legacy/pcas'>
make -C ./build tapfiles 
make[2]: Entering directory `<https://jenkins.aps.anl.gov/job/epics-base-3.16-linux32-test/ws/src/ca/legacy/pcas/build'>
make -C O.linux-x86 -f ../Makefile TOP=../../../../../.. \
	    T_A=linux-x86 tapfiles
make[3]: Entering directory `<https://jenkins.aps.anl.gov/job/epics-base-3.16-linux32-test/ws/src/ca/legacy/pcas/build/O.linux-x86'>
make[3]: Nothing to be done for `tapfiles'.
make[3]: Leaving directory `<https://jenkins.aps.anl.gov/job/epics-base-3.16-linux32-test/ws/src/ca/legacy/pcas/build/O.linux-x86'>
make[2]: Leaving directory `<https://jenkins.aps.anl.gov/job/epics-base-3.16-linux32-test/ws/src/ca/legacy/pcas/build'>
make -C ./example tapfiles 
make[2]: Entering directory `<https://jenkins.aps.anl.gov/job/epics-base-3.16-linux32-test/ws/src/ca/legacy/pcas/example'>
make -C ./directoryService tapfiles 
make[3]: Entering directory `<https://jenkins.aps.anl.gov/job/epics-base-3.16-linux32-test/ws/src/ca/legacy/pcas/example/directoryService'>
make -C O.linux-x86 -f ../Makefile TOP=../../../../../../.. \
	    T_A=linux-x86 tapfiles
make[4]: Entering directory `<https://jenkins.aps.anl.gov/job/epics-base-3.16-linux32-test/ws/src/ca/legacy/pcas/example/directoryService/O.linux-x86'>
make[4]: Nothing to be done for `tapfiles'.
make[4]: Leaving directory `<https://jenkins.aps.anl.gov/job/epics-base-3.16-linux32-test/ws/src/ca/legacy/pcas/example/directoryService/O.linux-x86'>
make[3]: Leaving directory `<https://jenkins.aps.anl.gov/job/epics-base-3.16-linux32-test/ws/src/ca/legacy/pcas/example/directoryService'>
make[2]: Leaving directory `<https://jenkins.aps.anl.gov/job/epics-base-3.16-linux32-test/ws/src/ca/legacy/pcas/example'>
make[1]: Leaving directory `<https://jenkins.aps.anl.gov/job/epics-base-3.16-linux32-test/ws/src/ca/legacy/pcas'>
make -C ./ioc tapfiles 
make[1]: Entering directory `<https://jenkins.aps.anl.gov/job/epics-base-3.16-linux32-test/ws/src/ioc'>
make -C O.linux-x86 -f ../Makefile TOP=../../.. \
	    T_A=linux-x86 tapfiles
make[2]: Entering directory `<https://jenkins.aps.anl.gov/job/epics-base-3.16-linux32-test/ws/src/ioc/O.linux-x86'>
make[2]: Nothing to be done for `tapfiles'.
make[2]: Leaving directory `<https://jenkins.aps.anl.gov/job/epics-base-3.16-linux32-test/ws/src/ioc/O.linux-x86'>
make[1]: Leaving directory `<https://jenkins.aps.anl.gov/job/epics-base-3.16-linux32-test/ws/src/ioc'>
make -C ca/legacy/pcas/ex tapfiles 
make[1]: Entering directory `<https://jenkins.aps.anl.gov/job/epics-base-3.16-linux32-test/ws/src/ca/legacy/pcas/ex'>
make -C O.linux-x86 -f ../Makefile TOP=../../../../../.. \
	    T_A=linux-x86 tapfiles
make[2]: Entering directory `<https://jenkins.aps.anl.gov/job/epics-base-3.16-linux32-test/ws/src/ca/legacy/pcas/ex/O.linux-x86'>
make[2]: Nothing to be done for `tapfiles'.
make[2]: Leaving directory `<https://jenkins.aps.anl.gov/job/epics-base-3.16-linux32-test/ws/src/ca/legacy/pcas/ex/O.linux-x86'>
make[1]: Leaving directory `<https://jenkins.aps.anl.gov/job/epics-base-3.16-linux32-test/ws/src/ca/legacy/pcas/ex'>
make -C ca/client/perl tapfiles 
make[1]: Entering directory `<https://jenkins.aps.anl.gov/job/epics-base-3.16-linux32-test/ws/src/ca/client/perl'>
make -C O.linux-x86 -f ../Makefile TOP=../../../../.. \
	    T_A=linux-x86 tapfiles
make[2]: Entering directory `<https://jenkins.aps.anl.gov/job/epics-base-3.16-linux32-test/ws/src/ca/client/perl/O.linux-x86'>
make[2]: Nothing to be done for `tapfiles'.
make[2]: Leaving directory `<https://jenkins.aps.anl.gov/job/epics-base-3.16-linux32-test/ws/src/ca/client/perl/O.linux-x86'>
make[1]: Leaving directory `<https://jenkins.aps.anl.gov/job/epics-base-3.16-linux32-test/ws/src/ca/client/perl'>
make -C ioc/db/test tapfiles 
make[1]: Entering directory `<https://jenkins.aps.anl.gov/job/epics-base-3.16-linux32-test/ws/src/ioc/db/test'>
make -C O.linux-x86 -f ../Makefile TOP=../../../../.. \
	    T_A=linux-x86 tapfiles
make[2]: Entering directory `<https://jenkins.aps.anl.gov/job/epics-base-3.16-linux32-test/ws/src/ioc/db/test/O.linux-x86'>
perl -CSD dbScanTest.t -tap > dbScanTest.tap
perl -CSD dbShutdownTest.t -tap > dbShutdownTest.tap
perl -CSD dbPutLinkTest.t -tap > dbPutLinkTest.tap
dbJLinkInit: lexical error: invalid char in json text.
                                  {"x":bbbb}
                     (right here) ------^

perl -CSD dbLockTest.t -tap > dbLockTest.tap
perl -CSD dbStressTest.t -tap > dbStressTest.tap
perl -CSD testdbConvert.t -tap > testdbConvert.tap
perl -CSD callbackTest.t -tap > callbackTest.tap
perl -CSD callbackParallelTest.t -tap > callbackParallelTest.tap
perl -CSD dbStateTest.t -tap > dbStateTest.tap
perl -CSD dbCaStatsTest.t -tap > dbCaStatsTest.tap
perl -CSD dbCaLinkTest.t -tap > dbCaLinkTest.tap
perl -CSD scanIoTest.t -tap > scanIoTest.tap
perl -CSD dbChannelTest.t -tap > dbChannelTest.tap
perl -CSD dbChArrTest.t -tap > dbChArrTest.tap
Starting iocInit
iocRun: All initialization complete
perl -CSD chfPluginTest.t -tap > chfPluginTest.tap
chfConfigParseStart: plugin pvt alloc failed
perl -CSD arrShorthandTest.t -tap > arrShorthandTest.tap
perl -CSD recGblCheckDeadbandTest.t -tap > recGblCheckDeadbandTest.tap
perl -CSD testPutGetTest.t -tap > testPutGetTest.tap
perl -CSD dbStaticTest.t -tap > dbStaticTest.tap
make[2]: Leaving directory `<https://jenkins.aps.anl.gov/job/epics-base-3.16-linux32-test/ws/src/ioc/db/test/O.linux-x86'>
make[1]: Leaving directory `<https://jenkins.aps.anl.gov/job/epics-base-3.16-linux32-test/ws/src/ioc/db/test'>
make -C ioc/dbtemplate/test tapfiles 
make[1]: Entering directory `<https://jenkins.aps.anl.gov/job/epics-base-3.16-linux32-test/ws/src/ioc/dbtemplate/test'>
make -C O.linux-x86 -f ../Makefile TOP=../../../../.. \
	    T_A=linux-x86 tapfiles
make[2]: Entering directory `<https://jenkins.aps.anl.gov/job/epics-base-3.16-linux32-test/ws/src/ioc/dbtemplate/test/O.linux-x86'>
perl -CSD msi.t -tap > msi.tap
make[2]: Leaving directory `<https://jenkins.aps.anl.gov/job/epics-base-3.16-linux32-test/ws/src/ioc/dbtemplate/test/O.linux-x86'>
make[1]: Leaving directory `<https://jenkins.aps.anl.gov/job/epics-base-3.16-linux32-test/ws/src/ioc/dbtemplate/test'>
make -C ./std tapfiles 
make[1]: Entering directory `<https://jenkins.aps.anl.gov/job/epics-base-3.16-linux32-test/ws/src/std'>
make -C O.linux-x86 -f ../Makefile TOP=../../.. \
	    T_A=linux-x86 tapfiles
make[2]: Entering directory `<https://jenkins.aps.anl.gov/job/epics-base-3.16-linux32-test/ws/src/std/O.linux-x86'>
make[2]: Nothing to be done for `tapfiles'.
make[2]: Leaving directory `<https://jenkins.aps.anl.gov/job/epics-base-3.16-linux32-test/ws/src/std/O.linux-x86'>
make[1]: Leaving directory `<https://jenkins.aps.anl.gov/job/epics-base-3.16-linux32-test/ws/src/std'>
make -C std/filters/test tapfiles 
make[1]: Entering directory `<https://jenkins.aps.anl.gov/job/epics-base-3.16-linux32-test/ws/src/std/filters/test'>
make -C O.linux-x86 -f ../Makefile TOP=../../../../.. \
	    T_A=linux-x86 tapfiles
make[2]: Entering directory `<https://jenkins.aps.anl.gov/job/epics-base-3.16-linux32-test/ws/src/std/filters/test/O.linux-x86'>
perl -CSD tsTest.t -tap > tsTest.tap
perl -CSD dbndTest.t -tap > dbndTest.tap
perl -CSD arrTest.t -tap > arrTest.tap
perl -CSD syncTest.t -tap > syncTest.tap
make[2]: Leaving directory `<https://jenkins.aps.anl.gov/job/epics-base-3.16-linux32-test/ws/src/std/filters/test/O.linux-x86'>
make[1]: Leaving directory `<https://jenkins.aps.anl.gov/job/epics-base-3.16-linux32-test/ws/src/std/filters/test'>
make -C std/rec/test tapfiles 
make[1]: Entering directory `<https://jenkins.aps.anl.gov/job/epics-base-3.16-linux32-test/ws/src/std/rec/test'>
make -C O.linux-x86 -f ../Makefile TOP=../../../../.. \
	    T_A=linux-x86 tapfiles
make[2]: Entering directory `<https://jenkins.aps.anl.gov/job/epics-base-3.16-linux32-test/ws/src/std/rec/test/O.linux-x86'>
perl -CSD arrayOpTest.t -tap > arrayOpTest.tap
perl -CSD recMiscTest.t -tap > recMiscTest.tap
perl -CSD linkRetargetLinkTest.t -tap > linkRetargetLinkTest.tap
perl -CSD linkInitTest.t -tap > linkInitTest.tap
perl -CSD compressTest.t -tap > compressTest.tap
perl -CSD asTest.t -tap > asTest.tap
perl -CSD analogMonitorTest.t -tap > analogMonitorTest.tap
Starting iocInit
perl -CSD regressTest.t -tap > regressTest.tap
make[2]: Leaving directory `<https://jenkins.aps.anl.gov/job/epics-base-3.16-linux32-test/ws/src/std/rec/test/O.linux-x86'>
make[1]: Leaving directory `<https://jenkins.aps.anl.gov/job/epics-base-3.16-linux32-test/ws/src/std/rec/test'>
make: Leaving directory `<https://jenkins.aps.anl.gov/job/epics-base-3.16-linux32-test/ws/src'>
+ make -s test-results
Breaktable.tap .. ok
DBD.tap ......... ok
Device.tap ...... ok
Driver.tap ...... ok
Function.tap .... ok
macLib.tap ...... ok
Menu.tap ........ ok
Recfield.tap .... ok
Recordtype.tap .. ok
Registrar.tap ... ok
Snippets.tap .... ok
Variable.tap .... ok
All tests successful.
Files=12, Tests=224,  0 wallclock secs ( 0.13 usr  0.04 sys +  0.00 cusr  0.02 csys =  0.19 CPU)
Result: PASS
epicsUnitTestTest.tap ........ ok
epicsTypesTest.tap ........... ok
epicsInlineTest.tap .......... ok
epicsCalcTest.tap ............ ok
epicsAlgorithmTest.tap ....... ok
epicsMathTest.tap ............ ok
epicsMMIOTest.tap ............ ok
epicsEllTest.tap ............. ok
epicsEnvTest.tap ............. ok
epicsErrlogTest.tap .......... ok
epicsStdioTest.tap ........... ok
epicsStdlibTest.tap .......... ok
epicsSockResolveTest.tap ..... ok
epicsStringTest.tap .......... ok
epicsTimeTest.tap ............ ok
epicsTimeZoneTest.tap ........ ok
epicsThreadTest.tap .......... ok
epicsThreadOnceTest.tap ...... ok
epicsThreadPriorityTest.tap .. ok
epicsThreadPrivateTest.tap ... ok
epicsThreadHooksTest.tap ..... ok
epicsThreadPoolTest.tap ...... ok
epicsExitTest.tap ............ ok
epicsTimerTest.tap ........... ok
ringPointerTest.tap .......... ok
ringBytesTest.tap ............ ok
epicsEventTest.tap ........... ok
epicsMutexTest.tap ........... ok
epicsSpinTest.tap ............ ok
epicsAtomicTest.tap .......... ok
macDefExpandTest.tap ......... ok
cvtFastTest.tap .............. ok
macLibTest.tap ............... ok
taskwdTest.tap ............... ok
blockingSockTest.tap ......... ok
epicsMessageQueueTest.tap .... ok
epicsStackTraceTest.tap ...... ok
ipAddrToAsciiTest.tap ........ ok
All tests successful.
Files=38, Tests=3964,  1 wallclock secs ( 0.90 usr  0.11 sys +  0.03 cusr  0.08 csys =  1.12 CPU)
Result: PASS
dbScanTest.tap ............... ok
dbShutdownTest.tap ........... ok
dbPutLinkTest.tap ............ ok
dbLockTest.tap ............... ok
dbStressTest.tap ............. ok
testdbConvert.tap ............ ok
callbackTest.tap ............. ok
callbackParallelTest.tap ..... ok
dbStateTest.tap .............. ok
dbCaStatsTest.tap ............ ok
dbCaLinkTest.tap ............. ok
scanIoTest.tap ............... ok
dbChannelTest.tap ............ ok
dbChArrTest.tap .............. ok
chfPluginTest.tap ............ ok
arrShorthandTest.tap ......... ok
recGblCheckDeadbandTest.tap .. ok
testPutGetTest.tap ........... ok
dbStaticTest.tap ............. ok
All tests successful.
Files=19, Tests=2790,  1 wallclock secs ( 0.66 usr  0.07 sys +  0.01 cusr  0.04 csys =  0.78 CPU)
Result: PASS
msi.tap .. ok
All tests successful.
Files=1, Tests=9,  0 wallclock secs ( 0.04 usr +  0.00 sys =  0.04 CPU)
Result: PASS
tsTest.tap .... ok
dbndTest.tap .. ok
arrTest.tap ... ok
syncTest.tap .. ok
All tests successful.
Files=4, Tests=1612,  0 wallclock secs ( 0.38 usr +  0.01 sys =  0.39 CPU)
Result: PASS
arrayOpTest.tap ........... ok
recMiscTest.tap ........... ok
linkRetargetLinkTest.tap .. ok
linkInitTest.tap .......... 
not ok 59 - dbGetField("i64i2", 7) -> 4294967297 == 1
Failed 1/72 subtests 
compressTest.tap .......... ok
asTest.tap ................ ok
analogMonitorTest.tap ..... ok
regressTest.tap ........... ok

Test Summary Report
-------------------
linkInitTest.tap        (Wstat: 0 Tests: 72 Failed: 1)
  Failed test:  59
Files=8, Tests=2077,  0 wallclock secs ( 0.44 usr  0.02 sys +  0.00 cusr  0.01 csys =  0.47 CPU)
Result: FAIL
make[3]: *** [test-results] Error 1
make[2]: *** [test-results.linux-x86] Error 2
make[1]: *** [std/rec/test.test-results] Error 2
make: *** [src.test-results] Error 2
Build step 'Execute shell' marked build as failure
TAP Reports Processing: START
Looking for TAP results report in workspace using pattern: src/**/O.linux-x86/*.tap
Saving reports...
There are failed test cases. Marking build as UNSTABLE
TAP Reports Processing: FINISH

Replies:
Jenkins build is back to normal : epics-base-3.16-linux32-test #80 APS Jenkins
References:
Build failed in Jenkins: epics-base-3.16-linux32-test #78 APS Jenkins

Navigate by Date:
Prev: Build failed in Jenkins: epics-base-3.16-win32s-test #82 APS Jenkins
Next: Build failed in Jenkins: epics-base-3.16-sol-test #81 APS Jenkins
Index: 2002  2003  2004  2005  2006  2007  2008  2009  2010  2011  2012  2013  2014  2015  2016  <2017
Navigate by Thread:
Prev: Build failed in Jenkins: epics-base-3.16-linux32-test #78 APS Jenkins
Next: Jenkins build is back to normal : epics-base-3.16-linux32-test #80 APS Jenkins
Index: 2002  2003  2004  2005  2006  2007  2008  2009  2010  2011  2012  2013  2014  2015  2016  <2017
ANJ, 24 May 2017 Valid HTML 4.01! · Home · News · About · Base · Modules · Extensions · Distributions · Download ·
· EPICS V4 · IRMIS · Talk · Bugs · Documents · Links · Licensing ·