Argonne National Laboratory

Experimental Physics and
Industrial Control System

2002  2003  2004  2005  2006  2007  2008  2009  2010  2011  2012  2013  2014  2015  2016  <2017 Index 2002  2003  2004  2005  2006  2007  2008  2009  2010  2011  2012  2013  2014  2015  2016  <2017
<== Date ==> <== Thread ==>

Subject: Build failed in Jenkins: epics-base-3.16-linux32-test #77
From: APS Jenkins <aps-jenkins@anl.gov>
To: core-talk@aps.anl.gov
Date: Tue, 23 May 2017 23:40:39 -0500 (CDT)
See <https://jenkins.aps.anl.gov/job/epics-base-3.16-linux32-test/77/display/redirect>

------------------------------------------
Started by upstream project "epics-base-3.16-linux32" build number 121
originally caused by:
 Started by upstream project "epics-base-3.16" build number 123
 originally caused by:
  Started by user Andrew Johnson
[EnvInject] - Loading node environment variables.
Building remotely on linux32-uranus (linux32) in workspace <https://jenkins.aps.anl.gov/job/epics-base-3.16-linux32-test/ws/>
[epics-base-3.16-linux32] $ /bin/sh -xe /tmp/hudson8199394636230080352.sh
+ make clean-tests
make -C ./configure clean-tests 
make[1]: Entering directory `<https://jenkins.aps.anl.gov/job/epics-base-3.16-linux32-test/ws/configure'>
make -C O.linux-x86 -f ../Makefile TOP=../.. \
	    T_A=linux-x86 clean-tests
make[2]: Entering directory `<https://jenkins.aps.anl.gov/job/epics-base-3.16-linux32-test/ws/configure/O.linux-x86'>
make[2]: Nothing to be done for `clean-tests'.
make[2]: Leaving directory `<https://jenkins.aps.anl.gov/job/epics-base-3.16-linux32-test/ws/configure/O.linux-x86'>
make[1]: Leaving directory `<https://jenkins.aps.anl.gov/job/epics-base-3.16-linux32-test/ws/configure'>
make -C ./src clean-tests 
make[1]: Entering directory `<https://jenkins.aps.anl.gov/job/epics-base-3.16-linux32-test/ws/src'>
make -C ./tools clean-tests 
make[2]: Entering directory `<https://jenkins.aps.anl.gov/job/epics-base-3.16-linux32-test/ws/src/tools'>
make -C O.linux-x86 -f ../Makefile TOP=../../.. \
	    T_A=linux-x86 clean-tests
make[3]: Entering directory `<https://jenkins.aps.anl.gov/job/epics-base-3.16-linux32-test/ws/src/tools/O.linux-x86'>
make[3]: Nothing to be done for `clean-tests'.
make[3]: Leaving directory `<https://jenkins.aps.anl.gov/job/epics-base-3.16-linux32-test/ws/src/tools/O.linux-x86'>
make[2]: Leaving directory `<https://jenkins.aps.anl.gov/job/epics-base-3.16-linux32-test/ws/src/tools'>
make -C tools/test clean-tests 
make[2]: Entering directory `<https://jenkins.aps.anl.gov/job/epics-base-3.16-linux32-test/ws/src/tools/test'>
make -C O.linux-x86 -f ../Makefile TOP=../../../.. \
	    T_A=linux-x86 clean-tests
make[3]: Entering directory `<https://jenkins.aps.anl.gov/job/epics-base-3.16-linux32-test/ws/src/tools/test/O.linux-x86'>
rm -f Breaktable.tap DBD.tap Device.tap Driver.tap Function.tap macLib.tap Menu.tap Recfield.tap Recordtype.tap Registrar.tap Snippets.tap Variable.tap
rm -f Breaktable.xml DBD.xml Device.xml Driver.xml Function.xml macLib.xml Menu.xml Recfield.xml Recordtype.xml Registrar.xml Snippets.xml Variable.xml
make[3]: Leaving directory `<https://jenkins.aps.anl.gov/job/epics-base-3.16-linux32-test/ws/src/tools/test/O.linux-x86'>
make[2]: Leaving directory `<https://jenkins.aps.anl.gov/job/epics-base-3.16-linux32-test/ws/src/tools/test'>
make -C template/base clean-tests 
make[2]: Entering directory `<https://jenkins.aps.anl.gov/job/epics-base-3.16-linux32-test/ws/src/template/base'>
make -C O.linux-x86 -f ../Makefile TOP=../../../.. \
	    T_A=linux-x86 clean-tests
make[3]: Entering directory `<https://jenkins.aps.anl.gov/job/epics-base-3.16-linux32-test/ws/src/template/base/O.linux-x86'>
make[3]: Nothing to be done for `clean-tests'.
make[3]: Leaving directory `<https://jenkins.aps.anl.gov/job/epics-base-3.16-linux32-test/ws/src/template/base/O.linux-x86'>
make[2]: Leaving directory `<https://jenkins.aps.anl.gov/job/epics-base-3.16-linux32-test/ws/src/template/base'>
make -C template/ext clean-tests 
make[2]: Entering directory `<https://jenkins.aps.anl.gov/job/epics-base-3.16-linux32-test/ws/src/template/ext'>
make -C O.linux-x86 -f ../Makefile TOP=../../../.. \
	    T_A=linux-x86 clean-tests
make[3]: Entering directory `<https://jenkins.aps.anl.gov/job/epics-base-3.16-linux32-test/ws/src/template/ext/O.linux-x86'>
make[3]: Nothing to be done for `clean-tests'.
make[3]: Leaving directory `<https://jenkins.aps.anl.gov/job/epics-base-3.16-linux32-test/ws/src/template/ext/O.linux-x86'>
make[2]: Leaving directory `<https://jenkins.aps.anl.gov/job/epics-base-3.16-linux32-test/ws/src/template/ext'>
make -C ./libCom clean-tests 
make[2]: Entering directory `<https://jenkins.aps.anl.gov/job/epics-base-3.16-linux32-test/ws/src/libCom'>
make -C O.linux-x86 -f ../Makefile TOP=../../.. \
	    T_A=linux-x86 clean-tests
make[3]: Entering directory `<https://jenkins.aps.anl.gov/job/epics-base-3.16-linux32-test/ws/src/libCom/O.linux-x86'>
make[3]: Nothing to be done for `clean-tests'.
make[3]: Leaving directory `<https://jenkins.aps.anl.gov/job/epics-base-3.16-linux32-test/ws/src/libCom/O.linux-x86'>
make[2]: Leaving directory `<https://jenkins.aps.anl.gov/job/epics-base-3.16-linux32-test/ws/src/libCom'>
make -C libCom/RTEMS clean-tests 
make[2]: Entering directory `<https://jenkins.aps.anl.gov/job/epics-base-3.16-linux32-test/ws/src/libCom/RTEMS'>
make -C O.linux-x86 -f ../Makefile TOP=../../../.. \
	    T_A=linux-x86 clean-tests
make[3]: Entering directory `<https://jenkins.aps.anl.gov/job/epics-base-3.16-linux32-test/ws/src/libCom/RTEMS/O.linux-x86'>
make[3]: Nothing to be done for `clean-tests'.
make[3]: Leaving directory `<https://jenkins.aps.anl.gov/job/epics-base-3.16-linux32-test/ws/src/libCom/RTEMS/O.linux-x86'>
make[2]: Leaving directory `<https://jenkins.aps.anl.gov/job/epics-base-3.16-linux32-test/ws/src/libCom/RTEMS'>
make -C libCom/test clean-tests 
make[2]: Entering directory `<https://jenkins.aps.anl.gov/job/epics-base-3.16-linux32-test/ws/src/libCom/test'>
make -C O.linux-x86 -f ../Makefile TOP=../../../.. \
	    T_A=linux-x86 clean-tests
make[3]: Entering directory `<https://jenkins.aps.anl.gov/job/epics-base-3.16-linux32-test/ws/src/libCom/test/O.linux-x86'>
rm -f epicsUnitTestTest.tap epicsTypesTest.tap epicsInlineTest.tap epicsCalcTest.tap epicsAlgorithmTest.tap epicsMathTest.tap epicsMMIOTest.tap epicsEllTest.tap epicsEnvTest.tap epicsErrlogTest.tap epicsStdioTest.tap epicsStdlibTest.tap epicsSockResolveTest.tap epicsStringTest.tap epicsTimeTest.tap epicsTimeZoneTest.tap epicsThreadTest.tap epicsThreadOnceTest.tap epicsThreadPriorityTest.tap epicsThreadPrivateTest.tap epicsThreadHooksTest.tap epicsThreadPoolTest.tap epicsExitTest.tap epicsTimerTest.tap ringPointerTest.tap ringBytesTest.tap epicsEventTest.tap epicsMutexTest.tap epicsSpinTest.tap epicsAtomicTest.tap macDefExpandTest.tap cvtFastTest.tap macLibTest.tap taskwdTest.tap blockingSockTest.tap epicsMessageQueueTest.tap epicsStackTraceTest.tap ipAddrToAsciiTest.tap
rm -f epicsUnitTestTest.xml epicsTypesTest.xml epicsInlineTest.xml epicsCalcTest.xml epicsAlgorithmTest.xml epicsMathTest.xml epicsMMIOTest.xml epicsEllTest.xml epicsEnvTest.xml epicsErrlogTest.xml epicsStdioTest.xml epicsStdlibTest.xml epicsSockResolveTest.xml epicsStringTest.xml epicsTimeTest.xml epicsTimeZoneTest.xml epicsThreadTest.xml epicsThreadOnceTest.xml epicsThreadPriorityTest.xml epicsThreadPrivateTest.xml epicsThreadHooksTest.xml epicsThreadPoolTest.xml epicsExitTest.xml epicsTimerTest.xml ringPointerTest.xml ringBytesTest.xml epicsEventTest.xml epicsMutexTest.xml epicsSpinTest.xml epicsAtomicTest.xml macDefExpandTest.xml cvtFastTest.xml macLibTest.xml taskwdTest.xml blockingSockTest.xml epicsMessageQueueTest.xml epicsStackTraceTest.xml ipAddrToAsciiTest.xml
make[3]: Leaving directory `<https://jenkins.aps.anl.gov/job/epics-base-3.16-linux32-test/ws/src/libCom/test/O.linux-x86'>
make[2]: Leaving directory `<https://jenkins.aps.anl.gov/job/epics-base-3.16-linux32-test/ws/src/libCom/test'>
make -C ca/client clean-tests 
make[2]: Entering directory `<https://jenkins.aps.anl.gov/job/epics-base-3.16-linux32-test/ws/src/ca/client'>
make -C O.linux-x86 -f ../Makefile TOP=../../../.. \
	    T_A=linux-x86 clean-tests
make[3]: Entering directory `<https://jenkins.aps.anl.gov/job/epics-base-3.16-linux32-test/ws/src/ca/client/O.linux-x86'>
make[3]: Nothing to be done for `clean-tests'.
make[3]: Leaving directory `<https://jenkins.aps.anl.gov/job/epics-base-3.16-linux32-test/ws/src/ca/client/O.linux-x86'>
make[2]: Leaving directory `<https://jenkins.aps.anl.gov/job/epics-base-3.16-linux32-test/ws/src/ca/client'>
make -C ca/client/tools clean-tests 
make[2]: Entering directory `<https://jenkins.aps.anl.gov/job/epics-base-3.16-linux32-test/ws/src/ca/client/tools'>
make -C O.linux-x86 -f ../Makefile TOP=../../../../.. \
	    T_A=linux-x86 clean-tests
make[3]: Entering directory `<https://jenkins.aps.anl.gov/job/epics-base-3.16-linux32-test/ws/src/ca/client/tools/O.linux-x86'>
make[3]: Nothing to be done for `clean-tests'.
make[3]: Leaving directory `<https://jenkins.aps.anl.gov/job/epics-base-3.16-linux32-test/ws/src/ca/client/tools/O.linux-x86'>
make[2]: Leaving directory `<https://jenkins.aps.anl.gov/job/epics-base-3.16-linux32-test/ws/src/ca/client/tools'>
make -C ca/legacy/gdd clean-tests 
make[2]: Entering directory `<https://jenkins.aps.anl.gov/job/epics-base-3.16-linux32-test/ws/src/ca/legacy/gdd'>
make -C O.linux-x86 -f ../Makefile TOP=../../../../.. \
	    T_A=linux-x86 clean-tests
make[3]: Entering directory `<https://jenkins.aps.anl.gov/job/epics-base-3.16-linux32-test/ws/src/ca/legacy/gdd/O.linux-x86'>
make[3]: Nothing to be done for `clean-tests'.
make[3]: Leaving directory `<https://jenkins.aps.anl.gov/job/epics-base-3.16-linux32-test/ws/src/ca/legacy/gdd/O.linux-x86'>
make[2]: Leaving directory `<https://jenkins.aps.anl.gov/job/epics-base-3.16-linux32-test/ws/src/ca/legacy/gdd'>
make -C ca/legacy/pcas clean-tests 
make[2]: Entering directory `<https://jenkins.aps.anl.gov/job/epics-base-3.16-linux32-test/ws/src/ca/legacy/pcas'>
make -C ./build clean-tests 
make[3]: Entering directory `<https://jenkins.aps.anl.gov/job/epics-base-3.16-linux32-test/ws/src/ca/legacy/pcas/build'>
make -C O.linux-x86 -f ../Makefile TOP=../../../../../.. \
	    T_A=linux-x86 clean-tests
make[4]: Entering directory `<https://jenkins.aps.anl.gov/job/epics-base-3.16-linux32-test/ws/src/ca/legacy/pcas/build/O.linux-x86'>
make[4]: Nothing to be done for `clean-tests'.
make[4]: Leaving directory `<https://jenkins.aps.anl.gov/job/epics-base-3.16-linux32-test/ws/src/ca/legacy/pcas/build/O.linux-x86'>
make[3]: Leaving directory `<https://jenkins.aps.anl.gov/job/epics-base-3.16-linux32-test/ws/src/ca/legacy/pcas/build'>
make -C ./example clean-tests 
make[3]: Entering directory `<https://jenkins.aps.anl.gov/job/epics-base-3.16-linux32-test/ws/src/ca/legacy/pcas/example'>
make -C ./directoryService clean-tests 
make[4]: Entering directory `<https://jenkins.aps.anl.gov/job/epics-base-3.16-linux32-test/ws/src/ca/legacy/pcas/example/directoryService'>
make -C O.linux-x86 -f ../Makefile TOP=../../../../../../.. \
	    T_A=linux-x86 clean-tests
make[5]: Entering directory `<https://jenkins.aps.anl.gov/job/epics-base-3.16-linux32-test/ws/src/ca/legacy/pcas/example/directoryService/O.linux-x86'>
make[5]: Nothing to be done for `clean-tests'.
make[5]: Leaving directory `<https://jenkins.aps.anl.gov/job/epics-base-3.16-linux32-test/ws/src/ca/legacy/pcas/example/directoryService/O.linux-x86'>
make[4]: Leaving directory `<https://jenkins.aps.anl.gov/job/epics-base-3.16-linux32-test/ws/src/ca/legacy/pcas/example/directoryService'>
make[3]: Leaving directory `<https://jenkins.aps.anl.gov/job/epics-base-3.16-linux32-test/ws/src/ca/legacy/pcas/example'>
make[2]: Leaving directory `<https://jenkins.aps.anl.gov/job/epics-base-3.16-linux32-test/ws/src/ca/legacy/pcas'>
make -C ./ioc clean-tests 
make[2]: Entering directory `<https://jenkins.aps.anl.gov/job/epics-base-3.16-linux32-test/ws/src/ioc'>
make -C O.linux-x86 -f ../Makefile TOP=../../.. \
	    T_A=linux-x86 clean-tests
make[3]: Entering directory `<https://jenkins.aps.anl.gov/job/epics-base-3.16-linux32-test/ws/src/ioc/O.linux-x86'>
make[3]: Nothing to be done for `clean-tests'.
make[3]: Leaving directory `<https://jenkins.aps.anl.gov/job/epics-base-3.16-linux32-test/ws/src/ioc/O.linux-x86'>
make[2]: Leaving directory `<https://jenkins.aps.anl.gov/job/epics-base-3.16-linux32-test/ws/src/ioc'>
make -C ca/legacy/pcas/ex clean-tests 
make[2]: Entering directory `<https://jenkins.aps.anl.gov/job/epics-base-3.16-linux32-test/ws/src/ca/legacy/pcas/ex'>
make -C O.linux-x86 -f ../Makefile TOP=../../../../../.. \
	    T_A=linux-x86 clean-tests
make[3]: Entering directory `<https://jenkins.aps.anl.gov/job/epics-base-3.16-linux32-test/ws/src/ca/legacy/pcas/ex/O.linux-x86'>
make[3]: Nothing to be done for `clean-tests'.
make[3]: Leaving directory `<https://jenkins.aps.anl.gov/job/epics-base-3.16-linux32-test/ws/src/ca/legacy/pcas/ex/O.linux-x86'>
make[2]: Leaving directory `<https://jenkins.aps.anl.gov/job/epics-base-3.16-linux32-test/ws/src/ca/legacy/pcas/ex'>
make -C ca/client/perl clean-tests 
make[2]: Entering directory `<https://jenkins.aps.anl.gov/job/epics-base-3.16-linux32-test/ws/src/ca/client/perl'>
make -C O.linux-x86 -f ../Makefile TOP=../../../../.. \
	    T_A=linux-x86 clean-tests
make[3]: Entering directory `<https://jenkins.aps.anl.gov/job/epics-base-3.16-linux32-test/ws/src/ca/client/perl/O.linux-x86'>
make[3]: Nothing to be done for `clean-tests'.
make[3]: Leaving directory `<https://jenkins.aps.anl.gov/job/epics-base-3.16-linux32-test/ws/src/ca/client/perl/O.linux-x86'>
make[2]: Leaving directory `<https://jenkins.aps.anl.gov/job/epics-base-3.16-linux32-test/ws/src/ca/client/perl'>
make -C ioc/db/test clean-tests 
make[2]: Entering directory `<https://jenkins.aps.anl.gov/job/epics-base-3.16-linux32-test/ws/src/ioc/db/test'>
make -C O.linux-x86 -f ../Makefile TOP=../../../../.. \
	    T_A=linux-x86 clean-tests
make[3]: Entering directory `<https://jenkins.aps.anl.gov/job/epics-base-3.16-linux32-test/ws/src/ioc/db/test/O.linux-x86'>
rm -f dbScanTest.tap dbShutdownTest.tap dbPutLinkTest.tap dbLockTest.tap dbStressTest.tap testdbConvert.tap callbackTest.tap callbackParallelTest.tap dbStateTest.tap dbCaStatsTest.tap dbCaLinkTest.tap scanIoTest.tap dbChannelTest.tap dbChArrTest.tap chfPluginTest.tap arrShorthandTest.tap recGblCheckDeadbandTest.tap testPutGetTest.tap dbStaticTest.tap
rm -f dbScanTest.xml dbShutdownTest.xml dbPutLinkTest.xml dbLockTest.xml dbStressTest.xml testdbConvert.xml callbackTest.xml callbackParallelTest.xml dbStateTest.xml dbCaStatsTest.xml dbCaLinkTest.xml scanIoTest.xml dbChannelTest.xml dbChArrTest.xml chfPluginTest.xml arrShorthandTest.xml recGblCheckDeadbandTest.xml testPutGetTest.xml dbStaticTest.xml
make[3]: Leaving directory `<https://jenkins.aps.anl.gov/job/epics-base-3.16-linux32-test/ws/src/ioc/db/test/O.linux-x86'>
make[2]: Leaving directory `<https://jenkins.aps.anl.gov/job/epics-base-3.16-linux32-test/ws/src/ioc/db/test'>
make -C ioc/dbtemplate/test clean-tests 
make[2]: Entering directory `<https://jenkins.aps.anl.gov/job/epics-base-3.16-linux32-test/ws/src/ioc/dbtemplate/test'>
make -C O.linux-x86 -f ../Makefile TOP=../../../../.. \
	    T_A=linux-x86 clean-tests
make[3]: Entering directory `<https://jenkins.aps.anl.gov/job/epics-base-3.16-linux32-test/ws/src/ioc/dbtemplate/test/O.linux-x86'>
rm -f msi.tap
rm -f msi.xml
make[3]: Leaving directory `<https://jenkins.aps.anl.gov/job/epics-base-3.16-linux32-test/ws/src/ioc/dbtemplate/test/O.linux-x86'>
make[2]: Leaving directory `<https://jenkins.aps.anl.gov/job/epics-base-3.16-linux32-test/ws/src/ioc/dbtemplate/test'>
make -C ./std clean-tests 
make[2]: Entering directory `<https://jenkins.aps.anl.gov/job/epics-base-3.16-linux32-test/ws/src/std'>
make -C O.linux-x86 -f ../Makefile TOP=../../.. \
	    T_A=linux-x86 clean-tests
make[3]: Entering directory `<https://jenkins.aps.anl.gov/job/epics-base-3.16-linux32-test/ws/src/std/O.linux-x86'>
make[3]: Nothing to be done for `clean-tests'.
make[3]: Leaving directory `<https://jenkins.aps.anl.gov/job/epics-base-3.16-linux32-test/ws/src/std/O.linux-x86'>
make[2]: Leaving directory `<https://jenkins.aps.anl.gov/job/epics-base-3.16-linux32-test/ws/src/std'>
make -C std/filters/test clean-tests 
make[2]: Entering directory `<https://jenkins.aps.anl.gov/job/epics-base-3.16-linux32-test/ws/src/std/filters/test'>
make -C O.linux-x86 -f ../Makefile TOP=../../../../.. \
	    T_A=linux-x86 clean-tests
make[3]: Entering directory `<https://jenkins.aps.anl.gov/job/epics-base-3.16-linux32-test/ws/src/std/filters/test/O.linux-x86'>
rm -f tsTest.tap dbndTest.tap arrTest.tap syncTest.tap
rm -f tsTest.xml dbndTest.xml arrTest.xml syncTest.xml
make[3]: Leaving directory `<https://jenkins.aps.anl.gov/job/epics-base-3.16-linux32-test/ws/src/std/filters/test/O.linux-x86'>
make[2]: Leaving directory `<https://jenkins.aps.anl.gov/job/epics-base-3.16-linux32-test/ws/src/std/filters/test'>
make -C std/rec/test clean-tests 
make[2]: Entering directory `<https://jenkins.aps.anl.gov/job/epics-base-3.16-linux32-test/ws/src/std/rec/test'>
make -C O.linux-x86 -f ../Makefile TOP=../../../../.. \
	    T_A=linux-x86 clean-tests
make[3]: Entering directory `<https://jenkins.aps.anl.gov/job/epics-base-3.16-linux32-test/ws/src/std/rec/test/O.linux-x86'>
rm -f arrayOpTest.tap recMiscTest.tap linkRetargetLinkTest.tap linkInitTest.tap compressTest.tap asTest.tap analogMonitorTest.tap regressTest.tap
rm -f arrayOpTest.xml recMiscTest.xml linkRetargetLinkTest.xml linkInitTest.xml compressTest.xml asTest.xml analogMonitorTest.xml regressTest.xml
make[3]: Leaving directory `<https://jenkins.aps.anl.gov/job/epics-base-3.16-linux32-test/ws/src/std/rec/test/O.linux-x86'>
make[2]: Leaving directory `<https://jenkins.aps.anl.gov/job/epics-base-3.16-linux32-test/ws/src/std/rec/test'>
make[1]: Leaving directory `<https://jenkins.aps.anl.gov/job/epics-base-3.16-linux32-test/ws/src'>
+ make -C src junitfiles CROSS_COMPILER_TARGET_ARCHS=
make: Entering directory `<https://jenkins.aps.anl.gov/job/epics-base-3.16-linux32-test/ws/src'>
make -C ./tools junitfiles 
make[1]: Entering directory `<https://jenkins.aps.anl.gov/job/epics-base-3.16-linux32-test/ws/src/tools'>
make -C O.linux-x86 -f ../Makefile TOP=../../.. \
	    T_A=linux-x86 junitfiles
make[2]: Entering directory `<https://jenkins.aps.anl.gov/job/epics-base-3.16-linux32-test/ws/src/tools/O.linux-x86'>
make[2]: Nothing to be done for `junitfiles'.
make[2]: Leaving directory `<https://jenkins.aps.anl.gov/job/epics-base-3.16-linux32-test/ws/src/tools/O.linux-x86'>
make[1]: Leaving directory `<https://jenkins.aps.anl.gov/job/epics-base-3.16-linux32-test/ws/src/tools'>
make -C tools/test junitfiles 
make[1]: Entering directory `<https://jenkins.aps.anl.gov/job/epics-base-3.16-linux32-test/ws/src/tools/test'>
make -C O.linux-x86 -f ../Makefile TOP=../../../.. \
	    T_A=linux-x86 junitfiles
make[2]: Entering directory `<https://jenkins.aps.anl.gov/job/epics-base-3.16-linux32-test/ws/src/tools/test/O.linux-x86'>
perl -CSD Breaktable.t -tap > Breaktable.tap
perl -CSD <https://jenkins.aps.anl.gov/job/epics-base-3.16-linux32-test/ws/bin/linux-x86/tap-to-junit-xml.pl> --puretap --output Breaktable.xml --input Breaktable.tap Breaktable
Can't locate XML/Generator.pm in @INC (@INC contains: /usr/local/lib/perl5 /usr/local/share/perl5 /usr/lib/perl5/vendor_perl /usr/share/perl5/vendor_perl /usr/lib/perl5 /usr/share/perl5 .) at <https://jenkins.aps.anl.gov/job/epics-base-3.16-linux32-test/ws/bin/linux-x86/tap-to-junit-xml.pl> line 106.
BEGIN failed--compilation aborted at <https://jenkins.aps.anl.gov/job/epics-base-3.16-linux32-test/ws/bin/linux-x86/tap-to-junit-xml.pl> line 106.
make[2]: *** [Breaktable.xml] Error 2
make[2]: Leaving directory `<https://jenkins.aps.anl.gov/job/epics-base-3.16-linux32-test/ws/src/tools/test/O.linux-x86'>
make[1]: *** [junitfiles.linux-x86] Error 2
make[1]: Leaving directory `<https://jenkins.aps.anl.gov/job/epics-base-3.16-linux32-test/ws/src/tools/test'>
make: *** [tools/test.junitfiles] Error 2
make: Leaving directory `<https://jenkins.aps.anl.gov/job/epics-base-3.16-linux32-test/ws/src'>
Build step 'Execute shell' marked build as failure
Recording test results
ERROR: Step ?Publish JUnit test result report? failed: No test report files were found. Configuration error?

Replies:
Build failed in Jenkins: epics-base-3.16-linux32-test #78 APS Jenkins

Navigate by Date:
Prev: Re: pvaSrv "can not monitor a link field" Michael Davidsaver
Next: Build failed in Jenkins: epics-base-3.16-linux32-test #78 APS Jenkins
Index: 2002  2003  2004  2005  2006  2007  2008  2009  2010  2011  2012  2013  2014  2015  2016  <2017
Navigate by Thread:
Prev: Re: pvaSrv "can not monitor a link field" Michael Davidsaver
Next: Build failed in Jenkins: epics-base-3.16-linux32-test #78 APS Jenkins
Index: 2002  2003  2004  2005  2006  2007  2008  2009  2010  2011  2012  2013  2014  2015  2016  <2017
ANJ, 23 May 2017 Valid HTML 4.01! · Home · News · About · Base · Modules · Extensions · Distributions · Download ·
· EPICS V4 · IRMIS · Talk · Bugs · Documents · Links · Licensing ·