Argonne National Laboratory

Experimental Physics and
Industrial Control System

1994  1995  1996  1997  1998  1999  2000  2001  2002  2003  2004  2005  2006  2007  2008  2009  2010  2011  2012  2013  2014  2015  2016  <2017 Index 1994  1995  1996  1997  1998  1999  2000  2001  2002  2003  2004  2005  2006  2007  2008  2009  2010  2011  2012  2013  2014  2015  2016  <2017
<== Date ==> <== Thread ==>

Subject: RE: error during build
From: Mark Rivers <rivers@cars.uchicago.edu>
To: Stefen Paul <stefen4114@gmail.com>, EPICS Tech Talk <tech-talk@aps.anl.gov>
Date: Tue, 4 Jul 2017 13:40:09 +0000
Hi Stefen,

It looks like you may need to install the package with g++.  What happens if you type these 3 commands:

g++
which g++
/usr/bin/g++

On my Centos 7 system g++ would be installed with the command

sudo yum install gcc-c++

Mark

________________________________
From: tech-talk-bounces@aps.anl.gov [tech-talk-bounces@aps.anl.gov] on behalf of Stefen Paul [stefen4114@gmail.com]
Sent: Tuesday, July 04, 2017 8:33 AM
To: EPICS Tech Talk
Subject: error during build

Hi All,

I am trying to build EPICS on a fresh and upgraded Linux installation.

When I run the make command, the process is stopping with following error messages towards the end



/usr/bin/g++ -c -D_POSIX_C_SOURCE=199506L -D_POSIX_THREADS -D_XOPEN_SOURCE=500 -D_X86_ -DUNIX -D_BSD_SOURCE -Dlinux -D_REENTRANT -O3 -g -Wall -m32 -fPIC -MMD -I. -I../O.Common -I. -I../../../src/libCom/osi/os/Linux -I../../../src/libCom/osi/os/posix -I../../../src/libCom/osi/os/default -I.. -I../../../src/libCom/bucketLib -I../../../src/libCom/ring -I../../../src/libCom/calc -I../../../src/libCom/cvtFast -I../../../src/libCom/cppStd -I../../../src/libCom/cxxTemplates -I../../../src/libCom/dbmf -I../../../src/libCom/ellLib -I../../../src/libCom/env -I../../../src/libCom/error -I../../../src/libCom/fdmgr -I../../../src/libCom/freeList -I../../../src/libCom/gpHash -I../../../src/libCom/iocsh -I../../../src/libCom/logClient -I../../../src/libCom/macLib -I../../../src/libCom/misc -I../../../src/libCom/osi -I../../../src/libCom/taskwd -I../../../src/libCom/timer -I../../../src/libCom/tsDefs -I../../../include/os/Linux -I../../../include ../../../src/libCom/ring/epicsRingPointer.cpp


make[3]: /usr/bin/g++: Command not found

make[3]: *** [epicsRingPointer.o] Error 127

make[3]: Leaving directory `/home/opal/epics/base/src/libCom/O.linux-x86'

make[2]: *** [install.linux-x86] Error 2

make[2]: Leaving directory `/home/opal/epics/base/src/libCom'

make[1]: *** [libCom.install] Error 2

make[1]: Leaving directory `/home/opal/epics/base/src'

make: *** [src.install] Error 2

opal@system1:~/epics/base-linux$


Any clues as to whats going wrong ?


Thanks,
Stefen

Replies:
Re: error during build Stefen Paul
References:
error during build Stefen Paul

Navigate by Date:
Prev: error during build Stefen Paul
Next: Plotting X-Y Data from the archive in CSS John . Holt
Index: 1994  1995  1996  1997  1998  1999  2000  2001  2002  2003  2004  2005  2006  2007  2008  2009  2010  2011  2012  2013  2014  2015  2016  <2017
Navigate by Thread:
Prev: error during build Stefen Paul
Next: Re: error during build Stefen Paul
Index: 1994  1995  1996  1997  1998  1999  2000  2001  2002  2003  2004  2005  2006  2007  2008  2009  2010  2011  2012  2013  2014  2015  2016  <2017
ANJ, 12 Jul 2017 Valid HTML 4.01! · Home · News · About · Base · Modules · Extensions · Distributions · Download ·
· EPICS V4 · IRMIS · Talk · Bugs · Documents · Links · Licensing ·