Argonne National Laboratory

Experimental Physics and
Industrial Control System

1994  1995  1996  1997  1998  1999  2000  2001  2002  2003  2004  2005  2006  2007  2008  2009  2010  2011  2012  2013  2014  <20152016  2017  Index 1994  1995  1996  1997  1998  1999  2000  2001  2002  2003  2004  2005  2006  2007  2008  2009  2010  2011  2012  2013  2014  <20152016  2017 
<== Date ==> <== Thread ==>

Subject: areadetector dbExpand.pl error: Braces must be closed in the same file they open in.
From: Heinz Junkes <junkes@fhi-berlin.mpg.de>
To: "tech-talk@aps.anl.gov (tech-talk@aps.anl.gov)" <tech-talk@aps.anl.gov>
Date: Fri, 9 Jan 2015 14:58:02 +0000
running into following trouble:

...
make[5]: Entering directory `/home/h1/EPICS/support/areaDetector/ADCore/iocs/simDetectorIOC/simDetectorApp/src'
make -C O.linux-x86_64 -f ../Makefile TOP=../../.. T_A=linux-x86_64 install
make[6]: Entering directory `/home/h1/EPICS/support/areaDetector/ADCore/iocs/simDetectorIOC/simDetectorApp/src/O.linux-x86_64'
Creating dbd file simDetectorApp.dbd
perl -CSD /home/h1/EPICS/base/bin/linux-x86_64/dbdExpand.pl  -I. -I.. -I../O.Common -I../../../dbd -I/home/h1/EPICS/base/dbd -I/home/h1/EPICS/support/asyn4-25/dbd -I/home/h1/EPICS/support/areaDetector/ADCore/dbd -I/home/h1/EPICS/support/calc-3-4/dbd -I/home/h1/EPICS/support/busy-1-6-1/dbd -I/home/h1/EPICS/support/sscan-2-10/dbd -I/home/h1/EPICS/support/autosave-5-5/dbd -o simDetectorApp.dbd simDetectorSupport.dbd commonDriverSupport.dbd
dbdExpand.pl: Leaving context "file '/home/h1/EPICS/support/areaDetector/ADCore/dbd/commonDriverSupport.dbd'", found "file '/home/h1/EPICS/support/areaDetector/ADCore/dbd/NDPluginSupport.dbd'" instead.
		Braces must be closed in the same file they open in.
Context: file '/home/h1/EPICS/support/areaDetector/ADCore/dbd/commonDriverSupport.dbd'
  while reading 'commonDriverSupport.dbd' to create 'simDetectorApp.dbd'
dbdExpand.pl: Exiting due to errors
make[6]: *** [../O.Common/simDetectorApp.dbd] Error 255
make[6]: Leaving directory `/home/h1/EPICS/support/areaDetector/ADCore/iocs/simDetectorIOC/simDetectorApp/src/O.linux-x86_64'
make[5]: *** [install.linux-x86_64] Error 2
make[5]: Leaving directory `/home/h1/EPICS/support/areaDetector/ADCore/iocs/simDetectorIOC/simDetectorApp/src'
make[4]: *** [src.install] Error 2
...

and don't know how to fix it ;-)

Where should I look? Which file may really cause the error?

Cheers,
Heinz


Attachment: smime.p7s
Description: S/MIME cryptographic signature


Replies:
RE: areadetector dbExpand.pl error: Braces must be closed in the same file they open in. Mark Rivers

Navigate by Date:
Prev: RE: Is it possible for an Asyn output record to be, also, an (I/O Intr - driven) input? Mark Rivers
Next: RE: areadetector dbExpand.pl error: Braces must be closed in the same file they open in. Mark Rivers
Index: 1994  1995  1996  1997  1998  1999  2000  2001  2002  2003  2004  2005  2006  2007  2008  2009  2010  2011  2012  2013  2014  <20152016  2017 
Navigate by Thread:
Prev: RE: Is it possible for an Asyn output record to be, also, an (I/O Intr - driven) input? Mark Rivers
Next: RE: areadetector dbExpand.pl error: Braces must be closed in the same file they open in. Mark Rivers
Index: 1994  1995  1996  1997  1998  1999  2000  2001  2002  2003  2004  2005  2006  2007  2008  2009  2010  2011  2012  2013  2014  <20152016  2017 
ANJ, 16 Dec 2015 Valid HTML 4.01! · Home · News · About · Base · Modules · Extensions · Distributions · Download ·
· EPICS V4 · IRMIS · Talk · Bugs · Documents · Links · Licensing ·