EPICS Controls Argonne National Laboratory

Experimental Physics and
Industrial Control System

1994  1995  1996  1997  1998  1999  2000  2001  2002  2003  2004  2005  2006  2007  2008  2009  2010  2011  <20122013  2014  2015  2016  2017  2018  2019  2020  2021  2022  2023  2024  Index 1994  1995  1996  1997  1998  1999  2000  2001  2002  2003  2004  2005  2006  2007  2008  2009  2010  2011  <20122013  2014  2015  2016  2017  2018  2019  2020  2021  2022  2023  2024 
<== Date ==> <== Thread ==>

Subject: RE: std_R3_1
From: "Szalata, Zenon M." <[email protected]>
To: Mark Rivers <[email protected]>, "[email protected]" <[email protected]>
Date: Tue, 31 Jan 2012 17:17:10 -0800

Thanks Mark,

I tried the latest version of sequencer (R2.1.4), which did not quite build correctly.  I did not think that mattered.  I now have regressed to an earlier version of sequencer (R2.0.12) and std built without errors.

I will look again at the R2.1.4 version of sequencer, see if I can fix that.

Thanks again,

Zen

 

From: Mark Rivers [mailto:[email protected]]
Sent: Tuesday, January 31, 2012 4:56 PM
To: Szalata, Zenon M.; [email protected]
Subject: RE: std_R3_1

 

femto is an SNL program.  Do you have the sequencer in your configure/RELEASE file in std?

 

Mark

 

 

From: [email protected] [mailto:[email protected]] On Behalf Of Szalata, Zenon M.
Sent: Tuesday, January 31, 2012 6:44 PM
To: [email protected]
Subject: std_R3_1

 

Building std_R3_1 fails on RHEL6 64bit with this error:

 

/usr/bin/gcc -c  -D_POSIX_C_SOURCE=199506L -D_POSIX_THREADS -D_XOPEN_SOURCE=500           -D_X86_64_  -DUNIX  -D_BSD_SOURCE -Dlinux  -D_REENTRANT   -g   -Wall      -m64     -fPIC -MMD -I. -I../O.Common -I. -I.. -I../../../include/os/Linux -I../../../include      -I/afs/slac/g/testfac/rhel6/epics/R3.14.12.2/modules/seq/R2.1.4/include  -I/afs/slac/g/testfac/rhel6/epics/R3.14.12.2/modules/asyn/R4.18/include -I/afs/slac/g/testfac/rhel6/epics/R3.14.12.2/base/include/os/Linux -I/afs/slac/g/testfac/rhel6/epics/R3.14.12.2/base/include       ../pvHistory.c

make[3]: *** No rule to make target `femto.o', needed by `libstd.a'.  Stop.

make[3]: Leaving directory `/afs/slac.stanford.edu/g/testfac/vol1/rhel6/epics/R3.14.12.2/modules/std/R3.1/stdApp/src/O.linux-x86_64'

make[2]: *** [install.linux-x86_64] Error 2

make[2]: Leaving directory `/afs/slac.stanford.edu/g/testfac/vol1/rhel6/epics/R3.14.12.2/modules/std/R3.1/stdApp/src'

make[1]: *** [src.install] Error 2

make[1]: Leaving directory `/afs/slac.stanford.edu/g/testfac/vol1/rhel6/epics/R3.14.12.2/modules/std/R3.1/stdApp'

make: *** [stdApp.install] Error 2

 

I did not try building on other architectures, so I don’t know the extent of my problem.

What am I missing on this computer?

 

Thanks for any help,

Zen

 


Replies:
Re: std_R3_1 Benjamin Franksen
Re: std_R3_1 Bruce Hill
References:
std_R3_1 Szalata, Zenon M.
RE: std_R3_1 Mark Rivers

Navigate by Date:
Prev: RE: std_R3_1 Mark Rivers
Next: mcaR7-0 Szalata, Zenon M.
Index: 1994  1995  1996  1997  1998  1999  2000  2001  2002  2003  2004  2005  2006  2007  2008  2009  2010  2011  <20122013  2014  2015  2016  2017  2018  2019  2020  2021  2022  2023  2024 
Navigate by Thread:
Prev: RE: std_R3_1 Mark Rivers
Next: Re: std_R3_1 Benjamin Franksen
Index: 1994  1995  1996  1997  1998  1999  2000  2001  2002  2003  2004  2005  2006  2007  2008  2009  2010  2011  <20122013  2014  2015  2016  2017  2018  2019  2020  2021  2022  2023  2024 
ANJ, 18 Nov 2013 Valid HTML 4.01! · Home · News · About · Base · Modules · Extensions · Distributions · Download ·
· Search · EPICS V4 · IRMIS · Talk · Bugs · Documents · Links · Licensing ·