g+
g+ Communities
Argonne National Laboratory

Experimental Physics and
Industrial Control System

1994  1995  1996  1997  1998  1999  2000  2001  2002  2003  2004  2005  2006  2007  2008  2009  2010  2011  <20122013  2014  Index 1994  1995  1996  1997  1998  1999  2000  2001  2002  2003  2004  2005  2006  2007  2008  2009  2010  2011  <20122013  2014 
<== Date ==> <== Thread ==>

Subject: RE: std_R3_1
From: Mark Rivers <rivers@cars.uchicago.edu>
To: "'Szalata, Zenon M.'" <zms@slac.stanford.edu>, "tech-talk@aps.anl.gov" <tech-talk@aps.anl.gov>
Date: Wed, 1 Feb 2012 00:55:41 +0000

femto is an SNL program.  Do you have the sequencer in your configure/RELEASE file in std?

 

Mark

 

 

From: tech-talk-bounces@aps.anl.gov [mailto:tech-talk-bounces@aps.anl.gov] On Behalf Of Szalata, Zenon M.
Sent: Tuesday, January 31, 2012 6:44 PM
To: tech-talk@aps.anl.gov
Subject: std_R3_1

 

Building std_R3_1 fails on RHEL6 64bit with this error:

 

/usr/bin/gcc -c  -D_POSIX_C_SOURCE=199506L -D_POSIX_THREADS -D_XOPEN_SOURCE=500           -D_X86_64_  -DUNIX  -D_BSD_SOURCE -Dlinux  -D_REENTRANT   -g   -Wall      -m64     -fPIC -MMD -I. -I../O.Common -I. -I.. -I../../../include/os/Linux -I../../../include      -I/afs/slac/g/testfac/rhel6/epics/R3.14.12.2/modules/seq/R2.1.4/include  -I/afs/slac/g/testfac/rhel6/epics/R3.14.12.2/modules/asyn/R4.18/include -I/afs/slac/g/testfac/rhel6/epics/R3.14.12.2/base/include/os/Linux -I/afs/slac/g/testfac/rhel6/epics/R3.14.12.2/base/include       ../pvHistory.c

make[3]: *** No rule to make target `femto.o', needed by `libstd.a'.  Stop.

make[3]: Leaving directory `/afs/slac.stanford.edu/g/testfac/vol1/rhel6/epics/R3.14.12.2/modules/std/R3.1/stdApp/src/O.linux-x86_64'

make[2]: *** [install.linux-x86_64] Error 2

make[2]: Leaving directory `/afs/slac.stanford.edu/g/testfac/vol1/rhel6/epics/R3.14.12.2/modules/std/R3.1/stdApp/src'

make[1]: *** [src.install] Error 2

make[1]: Leaving directory `/afs/slac.stanford.edu/g/testfac/vol1/rhel6/epics/R3.14.12.2/modules/std/R3.1/stdApp'

make: *** [stdApp.install] Error 2

 

I did not try building on other architectures, so I don’t know the extent of my problem.

What am I missing on this computer?

 

Thanks for any help,

Zen

 


Replies:
RE: std_R3_1 Szalata, Zenon M.
mcaR7-0 Szalata, Zenon M.
References:
std_R3_1 Szalata, Zenon M.

Navigate by Date:
Prev: std_R3_1 Szalata, Zenon M.
Next: RE: std_R3_1 Szalata, Zenon M.
Index: 1994  1995  1996  1997  1998  1999  2000  2001  2002  2003  2004  2005  2006  2007  2008  2009  2010  2011  <20122013  2014 
Navigate by Thread:
Prev: std_R3_1 Szalata, Zenon M.
Next: RE: std_R3_1 Szalata, Zenon M.
Index: 1994  1995  1996  1997  1998  1999  2000  2001  2002  2003  2004  2005  2006  2007  2008  2009  2010  2011  <20122013  2014 
ANJ, 18 Nov 2013 Valid HTML 4.01! · Home · News · About · Base · Modules · Extensions · Distributions · Download ·
· EPICSv4 · IRMIS · Talk · Bugs · Documents · Links · Licensing ·