Argonne National Laboratory

Experimental Physics and
Industrial Control System

1994  1995  1996  1997  1998  1999  2000  2001  2002  2003  2004  2005  2006  2007  2008  2009  <20102011  2012  2013  2014  2015  2016  2017  Index 1994  1995  1996  1997  1998  1999  2000  2001  2002  2003  2004  2005  2006  2007  2008  2009  <20102011  2012  2013  2014  2015  2016  2017 
<== Date ==> <== Thread ==>

Subject: error compiling base for rtems
From: "Silver" <marco_hair@163.com>
To: "tech-talk" <tech-talk@aps.anl.gov>
Date: Mon, 28 Jun 2010 10:56:09 +0800
hi, 

when I tried to compile the base3.14.10 for latest RTEMS version, it shows the following errors:

make[3]: Entering directory `/usr/local/epics/r3.14.10/base-3.14.10/src/libCom/O.RTEMS-pc386'
/opt/rtems/bin/i386-rtems-g++ -B/opt/rtems/i386-rtems/pc386/lib/ -specs bsp_specs -qrtems   -c   -mtune=i386               -DUNIX      -O2 -g -g  -Wall         -DOMIT_NFS_SUPPORT  -I. -I../O.Common -I. -I../../../src/libCom/osi/os/RTEMS -I../../../src/libCom/osi/os/posix -I../../../src/libCom/osi/os/default -I.. -I../../../src/libCom/bucketLib -I../../../src/libCom/ring -I../../../src/libCom/calc -I../../../src/libCom/cvtFast -I../../../src/libCom/cppStd -I../../../src/libCom/cxxTemplates -I../../../src/libCom/dbmf -I../../../src/libCom/ellLib -I../../../src/libCom/env -I../../../src/libCom/error -I../../../src/libCom/fdmgr -I../../../src/libCom/freeList -I../../../src/libCom/gpHash -I../../../src/libCom/iocsh -I../../../src/libCom/logClient -I../../../src/libCom/macLib -I../../../src/libCom/misc -I../../../src/libCom/osi -I../../../src/libCom/taskwd -I../../../src/libCom/timer -I../../../src/libCom/tsDefs -I../../../include/os/RTEMS -I../../../include         ../../../src/l!
 ibCom/osi/os/RTEMS/osdTime.cpp 
../../../src/libCom/osi/os/RTEMS/osdTime.cpp: In function 'void osdNTPInit()':
../../../src/libCom/osi/os/RTEMS/osdTime.cpp:61: error: 'close' was not declared in this scope
../../../src/libCom/osi/os/RTEMS/osdTime.cpp: At global scope:
../../../src/libCom/osi/os/RTEMS/osdTime.cpp:132: warning: 'done' defined but not used
make[3]: *** [osdTime.o] Error 1
make[3]: Leaving directory `/usr/local/epics/r3.14.10/base-3.14.10/src/libCom/O.RTEMS-pc386'
make[2]: *** [install.RTEMS-pc386] Error 2
make[2]: Leaving directory `/usr/local/epics/r3.14.10/base-3.14.10/src/libCom'
make[1]: *** [libCom.install] Error 2
make[1]: Leaving directory `/usr/local/epics/r3.14.10/base-3.14.10/src'
make: *** [src.install] Error 2
  
can anyone give some hints? thanks a lot for your help.

Best regards
Geyang  2010-06-28



Replies:
Re: error compiling base for rtems Eric Norum

Navigate by Date:
Prev: Re: Re: error building latest rtems Silver
Next: Re: error compiling base for rtems Eric Norum
Index: 1994  1995  1996  1997  1998  1999  2000  2001  2002  2003  2004  2005  2006  2007  2008  2009  <20102011  2012  2013  2014  2015  2016  2017 
Navigate by Thread:
Prev: Re: Re: error building latest rtems Silver
Next: Re: error compiling base for rtems Eric Norum
Index: 1994  1995  1996  1997  1998  1999  2000  2001  2002  2003  2004  2005  2006  2007  2008  2009  <20102011  2012  2013  2014  2015  2016  2017 
ANJ, 02 Sep 2010 Valid HTML 4.01! · Home · News · About · Base · Modules · Extensions · Distributions · Download ·
· EPICS V4 · IRMIS · Talk · Bugs · Documents · Links · Licensing ·