g+
g+ Communities
Argonne National Laboratory

Experimental Physics and
Industrial Control System

1994  1995  1996  1997  1998  1999  2000  2001  2002  2003  2004  <20052006  2007  2008  2009  2010  2011  2012  2013  2014  Index 1994  1995  1996  1997  1998  1999  2000  2001  2002  2003  2004  <20052006  2007  2008  2009  2010  2011  2012  2013  2014 
<== Date ==> <== Thread ==>

Subject: Problem building 3.14.7 on win32-x86
From: "Mark Rivers" <rivers@cars.uchicago.edu>
To: <tech-talk@aps.anl.gov>
Date: Tue, 4 Jan 2005 18:54:56 -0600
Folks,

I am trying to build EPICS 3.14.7 on Windows (win32-x86).  I am using
Visual C++ 6.0.  I get the following error when building
libCom/epicsThread.cpp.

cl /nologo /GX /GR -c              /D__STDC__=0  /Ox  /W3        /MD
-I. -I.. -I..\\..\\..\\src\\libCom\\bucketLib -I
...\\..\\..\\src\\libCom\\ring -I..\\..\\..\\src\\libCom\\calc
-I..\\..\\..\\src\\libCom\\cvtFast -I..\\..\\..\\src\\libC
om\\cppStd -I..\\..\\..\\src\\libCom\\cxxTemplates
-I..\\..\\..\\src\\libCom\\dbmf -I..\\..\\..\\src\\libCom\\ellLib -I.
..\\..\\..\\src\\libCom\\env -I..\\..\\..\\src\\libCom\\error
-I..\\..\\..\\src\\libCom\\fdmgr -I..\\..\\..\\src\\libCom\
\freeList -I..\\..\\..\\src\\libCom\\gpHash
-I..\\..\\..\\src\\libCom\\logClient -I..\\..\\..\\src\\libCom\\macLib
-I..\
\..\\..\\src\\libCom\\misc -I..\\..\\..\\src\\libCom\\osi
-I..\\..\\..\\src\\libCom\\taskwd -I..\\..\\..\\src\\libCom\\t
imer -I..\\..\\..\\src\\libCom\\tsDefs -I..\\..\\..\\include\\os\\WIN32
-I..\\..\\..\\include        /Tp ..\\..\\..\\src
\\libCom\\osi\\epicsThread.cpp
epicsThread.cpp
...\..\..\src\libCom\osi\epicsThread.cpp(80) : error C2039: 'unexpected'
: is not a member of 'std'
...\..\..\src\libCom\osi\epicsThread.cpp(96) : error C2039: 'unexpected'
: is not a member of 'std'
make[3]: *** [epicsThread.obj] Error 2
make[3]: Leaving directory
`/cygdrive/h/epics/base-3.14.7/src/libCom/O.win32-x86'
make[2]: *** [install.win32-x86] Error 2
make[2]: Leaving directory `/cygdrive/h/epics/base-3.14.7/src/libCom'
make[1]: *** [libCom.install] Error 2
make[1]: Leaving directory `/cygdrive/h/epics/base-3.14.7/src'
make: *** [src.install] Error 2

Is this a known problem, and is there a fix?

Thanks,
Mark


Replies:
RE: Problem building 3.14.7 on win32-x86 Jeff Hill

Navigate by Date:
Prev: A New Year, A New Start Ned Arnold
Next: RE: Problem building 3.14.7 on win32-x86 Jeff Hill
Index: 1994  1995  1996  1997  1998  1999  2000  2001  2002  2003  2004  <20052006  2007  2008  2009  2010  2011  2012  2013  2014 
Navigate by Thread:
Prev: Web service interfaces for EPICS Bill St. Arnaud
Next: RE: Problem building 3.14.7 on win32-x86 Jeff Hill
Index: 1994  1995  1996  1997  1998  1999  2000  2001  2002  2003  2004  <20052006  2007  2008  2009  2010  2011  2012  2013  2014 
ANJ, 02 Sep 2010 Valid HTML 4.01! · Home · News · About · Base · Modules · Extensions · Distributions · Download ·
· EPICSv4 · IRMIS · Talk · Bugs · Documents · Links · Licensing ·