Argonne National Laboratory

Experimental Physics and
Industrial Control System

2002  2003  2004  2005  2006  2007  2008  2009  2010  2011  2012  2013  2014  2015  2016  <2017 Index 2002  2003  2004  2005  2006  2007  2008  2009  2010  2011  2012  2013  2014  2015  2016  <2017
<== Date ==> <== Thread ==>

Subject: Build failed in Jenkins: epics-base-3.15-linux32-test #128
From: APS Jenkins <aps-jenkins@anl.gov>
To: core-talk@aps.anl.gov
Date: Wed, 15 Nov 2017 22:56:00 -0600 (CST)
See <https://jenkins.aps.anl.gov/job/epics-base-3.15-linux32-test/128/display/redirect>

------------------------------------------
Started by user Andrew Johnson
[EnvInject] - Loading node environment variables.
Building remotely on linux32-uranus (linux32) in workspace <https://jenkins.aps.anl.gov/job/epics-base-3.15-linux32-test/ws/>
[epics-base-3.15-linux32] $ /bin/sh -xe /tmp/hudson800255682297564174.sh
+ make -s clean-tests
+ make -j4 --no-print-directory junitfiles CROSS_COMPILER_TARGET_ARCHS=
make -C ./configure junitfiles 
make -C O.linux-x86 -f ../Makefile TOP=../.. \
	    T_A=linux-x86 junitfiles
make[2]: Nothing to be done for `junitfiles'.
make -C ./src junitfiles 
make -C ./tools junitfiles 
make -C O.linux-x86 -f ../Makefile TOP=../../.. \
	    T_A=linux-x86 junitfiles
make[3]: Nothing to be done for `junitfiles'.
make -C tools/test junitfiles 
make -C template/base junitfiles 
make -C template/ext junitfiles 
make -C ./libCom junitfiles 
make -C O.linux-x86 -f ../Makefile TOP=../../../.. \
make -C O.linux-x86 -f ../Makefile TOP=../../../.. \
	    T_A=linux-x86 junitfiles
make -C O.linux-x86 -f ../Makefile TOP=../../../.. \
	    T_A=linux-x86 junitfiles
	    T_A=linux-x86 junitfiles
make -C O.linux-x86 -f ../Makefile TOP=../../.. \
	    T_A=linux-x86 junitfiles
perl -CSD Breaktable.t -tap > Breaktable.tap
make[3]: Nothing to be done for `junitfiles'.
make[3]: Nothing to be done for `junitfiles'.
perl -CSD DBD.t -tap > DBD.tap
perl -CSD Device.t -tap > Device.tap
perl -CSD Driver.t -tap > Driver.tap
perl -CSD Function.t -tap > Function.tap
perl -CSD macLib.t -tap > macLib.tap
perl -CSD Menu.t -tap > Menu.tap
perl -CSD Recfield.t -tap > Recfield.tap
perl -CSD Recordtype.t -tap > Recordtype.tap
perl -CSD Registrar.t -tap > Registrar.tap
perl -CSD Snippets.t -tap > Snippets.tap
perl -CSD Variable.t -tap > Variable.tap
perl -CSD <https://jenkins.aps.anl.gov/job/epics-base-3.15-linux32-test/ws/bin/linux-x86/tap-to-junit-xml.pl> --puretap --output Breaktable.xml --input Breaktable.tap Breaktable
perl -CSD <https://jenkins.aps.anl.gov/job/epics-base-3.15-linux32-test/ws/bin/linux-x86/tap-to-junit-xml.pl> --puretap --output DBD.xml --input DBD.tap DBD
Can't locate XML/Generator.pm in @INC (@INC contains: /usr/local/lib/perl5 /usr/local/share/perl5 /usr/lib/perl5/vendor_perl /usr/share/perl5/vendor_perl /usr/lib/perl5 /usr/share/perl5 .) at <https://jenkins.aps.anl.gov/job/epics-base-3.15-linux32-test/ws/bin/linux-x86/tap-to-junit-xml.pl> line 106.
BEGIN failed--compilation aborted at <https://jenkins.aps.anl.gov/job/epics-base-3.15-linux32-test/ws/bin/linux-x86/tap-to-junit-xml.pl> line 106.
make[3]: *** [Breaktable.xml] Error 2
make[3]: *** Waiting for unfinished jobs....
Can't locate XML/Generator.pm in @INC (@INC contains: /usr/local/lib/perl5 /usr/local/share/perl5 /usr/lib/perl5/vendor_perl /usr/share/perl5/vendor_perl /usr/lib/perl5 /usr/share/perl5 .) at <https://jenkins.aps.anl.gov/job/epics-base-3.15-linux32-test/ws/bin/linux-x86/tap-to-junit-xml.pl> line 106.
BEGIN failed--compilation aborted at <https://jenkins.aps.anl.gov/job/epics-base-3.15-linux32-test/ws/bin/linux-x86/tap-to-junit-xml.pl> line 106.
make[3]: *** [DBD.xml] Error 2
make[2]: *** [junitfiles.linux-x86] Error 2
make[1]: *** [tools/test.junitfiles] Error 2
make[1]: *** Waiting for unfinished jobs....
make[3]: Nothing to be done for `junitfiles'.
make: *** [src.junitfiles] Error 2
Build step 'Execute shell' marked build as failure
Recording test results
ERROR: Step ?Publish JUnit test result report? failed: No test report files were found. Configuration error?

Replies:
Jenkins build is back to normal : epics-base-3.15-linux32-test #129 APS Jenkins
References:
Build failed in Jenkins: epics-base-3.15-linux32-test #127 APS Jenkins

Navigate by Date:
Prev: Build failed in Jenkins: epics-base-3.15-linux32-test #127 APS Jenkins
Next: Jenkins build is back to normal : epics-base-3.15-linux32-test #129 APS Jenkins
Index: 2002  2003  2004  2005  2006  2007  2008  2009  2010  2011  2012  2013  2014  2015  2016  <2017
Navigate by Thread:
Prev: Build failed in Jenkins: epics-base-3.15-linux32-test #127 APS Jenkins
Next: Jenkins build is back to normal : epics-base-3.15-linux32-test #129 APS Jenkins
Index: 2002  2003  2004  2005  2006  2007  2008  2009  2010  2011  2012  2013  2014  2015  2016  <2017
ANJ, 15 Nov 2017 Valid HTML 4.01! · Home · News · About · Base · Modules · Extensions · Distributions · Download ·
· EPICS V4 · IRMIS · Talk · Bugs · Documents · Links · Licensing ·