Argonne National Laboratory

Experimental Physics and
Industrial Control System

2002  2003  2004  2005  2006  2007  2008  2009  2010  2011  2012  2013  2014  2015  2016  <2017 Index 2002  2003  2004  2005  2006  2007  2008  2009  2010  2011  2012  2013  2014  2015  2016  <2017
<== Date ==> <== Thread ==>

Subject: Build failed in Jenkins: epics-base-3.16-rtems #133
From: APS Jenkins <aps-jenkins@anl.gov>
To: core-talk@aps.anl.gov
Date: Wed, 5 Jul 2017 17:44:10 -0500 (CDT)
See <https://jenkins.aps.anl.gov/job/epics-base-3.16-rtems/133/display/redirect>

------------------------------------------
[...truncated 4.78 KB...]
make[3]: Entering directory `/Jenkins/jenkins/jobs/epics-base-3.16/workspace/src/template/ext/O.linux-x86_64'
make[3]: Nothing to be done for `all'.
make[3]: Leaving directory `/Jenkins/jenkins/jobs/epics-base-3.16/workspace/src/template/ext/O.linux-x86_64'
make -C O.RTEMS-uC5282 -f ../Makefile TOP=../../../.. T_A=RTEMS-uC5282
make[3]: Entering directory `/Jenkins/jenkins/jobs/epics-base-3.16/workspace/src/template/ext/O.RTEMS-uC5282'
make[3]: Nothing to be done for `default_target'.
make[3]: Leaving directory `/Jenkins/jenkins/jobs/epics-base-3.16/workspace/src/template/ext/O.RTEMS-uC5282'
make[2]: Leaving directory `/Jenkins/jenkins/jobs/epics-base-3.16/workspace/src/template/ext'
make -C ./libCom RTEMS-uC5282 
make[2]: Entering directory `/Jenkins/jenkins/jobs/epics-base-3.16/workspace/src/libCom'
make -C O.linux-x86_64 -f ../Makefile TOP=../../.. T_A=linux-x86_64
make[3]: Entering directory `/Jenkins/jenkins/jobs/epics-base-3.16/workspace/src/libCom/O.linux-x86_64'
make[3]: Nothing to be done for `all'.
make[3]: Leaving directory `/Jenkins/jenkins/jobs/epics-base-3.16/workspace/src/libCom/O.linux-x86_64'
make -C O.RTEMS-uC5282 -f ../Makefile TOP=../../.. T_A=RTEMS-uC5282
make[3]: Entering directory `/Jenkins/jenkins/jobs/epics-base-3.16/workspace/src/libCom/O.RTEMS-uC5282'
/usr/local/vw/rtems/rtems-4.10.2/bin/m68k-rtems4.10.2-gcc --pipe -B/usr/local/rtems/rtems-4.10.2/m68k-rtems4.10.2/uC5282/lib/ -specs bsp_specs -qrtems   -fasm   -mcpu=5282         -DUSE_TYPED_RSET         -DUNIX      -O2 -g -g   -Wall       -DMY_DO_BOOTP=NULL     -I. -I../O.Common -I. -I../../../src/libCom/osi/compiler/gcc -I../../../src/libCom/osi/compiler/default -I. -I../../../src/libCom/osi/os/RTEMS -I../../../src/libCom/osi/os/posix -I../../../src/libCom/osi/os/default -I.. -I../../../src/libCom/as -I../../../src/libCom/bucketLib -I../../../src/libCom/calc -I../../../src/libCom/cvtFast -I../../../src/libCom/cppStd -I../../../src/libCom/cxxTemplates -I../../../src/libCom/dbmf -I../../../src/libCom/ellLib -I../../../src/libCom/env -I../../../src/libCom/error -I../../../src/libCom/fdmgr -I../../../src/libCom/flex -I../../../src/libCom/freeList -I../../../src/libCom/gpHash -I../../../src/libCom/iocsh -I../../../src/libCom/log -I../../../src/libCom/macLib -I../../../src/libCom/misc -I../../../src/libCom/osi -I../../../src/libCom/pool -I../../../src/libCom/ring -I../../../src/libCom/taskwd -I../../../src/libCom/timer -I../../../src/libCom/yacc -I../../../src/libCom/yacc -I../../../src/libCom/yajl -I../../../include/compiler/gcc -I../../../include/os/RTEMS -I../../../include         -MM -MF osiNTPTime.d  ../../../src/libCom/osi/osiNTPTime.c
/usr/local/vw/rtems/rtems-4.10.2/bin/../libexec/gcc/m68k-rtems4.10.2/4.4.7/cc1: error while loading shared libraries: libmpfr.so.1: cannot open shared object file: No such file or directory
/usr/local/vw/rtems/rtems-4.10.2/bin/m68k-rtems4.10.2-gcc --pipe -B/usr/local/rtems/rtems-4.10.2/m68k-rtems4.10.2/uC5282/lib/ -specs bsp_specs -qrtems   -fasm   -mcpu=5282         -DUSE_TYPED_RSET         -DUNIX      -O2 -g -g   -Wall       -DMY_DO_BOOTP=NULL     -I. -I../O.Common -I. -I../../../src/libCom/osi/compiler/gcc -I../../../src/libCom/osi/compiler/default -I. -I../../../src/libCom/osi/os/RTEMS -I../../../src/libCom/osi/os/posix -I../../../src/libCom/osi/os/default -I.. -I../../../src/libCom/as -I../../../src/libCom/bucketLib -I../../../src/libCom/calc -I../../../src/libCom/cvtFast -I../../../src/libCom/cppStd -I../../../src/libCom/cxxTemplates -I../../../src/libCom/dbmf -I../../../src/libCom/ellLib -I../../../src/libCom/env -I../../../src/libCom/error -I../../../src/libCom/fdmgr -I../../../src/libCom/flex -I../../../src/libCom/freeList -I../../../src/libCom/gpHash -I../../../src/libCom/iocsh -I../../../src/libCom/log -I../../../src/libCom/macLib -I../../../src/libCom/misc -I../../../src/libCom/osi -I../../../src/libCom/pool -I../../../src/libCom/ring -I../../../src/libCom/taskwd -I../../../src/libCom/timer -I../../../src/libCom/yacc -I../../../src/libCom/yacc -I../../../src/libCom/yajl -I../../../include/compiler/gcc -I../../../include/os/RTEMS -I../../../include         -MM -MF yajl_parser.d  ../../../src/libCom/yajl/yajl_parser.c
/usr/local/vw/rtems/rtems-4.10.2/bin/../libexec/gcc/m68k-rtems4.10.2/4.4.7/cc1: error while loading shared libraries: libmpfr.so.1: cannot open shared object file: No such file or directory
/usr/local/vw/rtems/rtems-4.10.2/bin/m68k-rtems4.10.2-gcc --pipe -B/usr/local/rtems/rtems-4.10.2/m68k-rtems4.10.2/uC5282/lib/ -specs bsp_specs -qrtems   -fasm   -mcpu=5282         -DUSE_TYPED_RSET         -DUNIX      -O2 -g -g   -Wall       -DMY_DO_BOOTP=NULL     -I. -I../O.Common -I. -I../../../src/libCom/osi/compiler/gcc -I../../../src/libCom/osi/compiler/default -I. -I../../../src/libCom/osi/os/RTEMS -I../../../src/libCom/osi/os/posix -I../../../src/libCom/osi/os/default -I.. -I../../../src/libCom/as -I../../../src/libCom/bucketLib -I../../../src/libCom/calc -I../../../src/libCom/cvtFast -I../../../src/libCom/cppStd -I../../../src/libCom/cxxTemplates -I../../../src/libCom/dbmf -I../../../src/libCom/ellLib -I../../../src/libCom/env -I../../../src/libCom/error -I../../../src/libCom/fdmgr -I../../../src/libCom/flex -I../../../src/libCom/freeList -I../../../src/libCom/gpHash -I../../../src/libCom/iocsh -I../../../src/libCom/log -I../../../src/libCom/macLib -I../../../src/libCom/misc -I../../../src/libCom/osi -I../../../src/libCom/pool -I../../../src/libCom/ring -I../../../src/libCom/taskwd -I../../../src/libCom/timer -I../../../src/libCom/yacc -I../../../src/libCom/yacc -I../../../src/libCom/yajl -I../../../include/compiler/gcc -I../../../include/os/RTEMS -I../../../include         -MM -MF yajl_lex.d  ../../../src/libCom/yajl/yajl_lex.c
/usr/local/vw/rtems/rtems-4.10.2/bin/../libexec/gcc/m68k-rtems4.10.2/4.4.7/cc1: error while loading shared libraries: libmpfr.so.1: cannot open shared object file: No such file or directory
/usr/local/vw/rtems/rtems-4.10.2/bin/m68k-rtems4.10.2-gcc --pipe -B/usr/local/rtems/rtems-4.10.2/m68k-rtems4.10.2/uC5282/lib/ -specs bsp_specs -qrtems   -fasm   -mcpu=5282         -DUSE_TYPED_RSET         -DUNIX      -O2 -g -g   -Wall       -DMY_DO_BOOTP=NULL     -I. -I../O.Common -I. -I../../../src/libCom/osi/compiler/gcc -I../../../src/libCom/osi/compiler/default -I. -I../../../src/libCom/osi/os/RTEMS -I../../../src/libCom/osi/os/posix -I../../../src/libCom/osi/os/default -I.. -I../../../src/libCom/as -I../../../src/libCom/bucketLib -I../../../src/libCom/calc -I../../../src/libCom/cvtFast -I../../../src/libCom/cppStd -I../../../src/libCom/cxxTemplates -I../../../src/libCom/dbmf -I../../../src/libCom/ellLib -I../../../src/libCom/env -I../../../src/libCom/error -I../../../src/libCom/fdmgr -I../../../src/libCom/flex -I../../../src/libCom/freeList -I../../../src/libCom/gpHash -I../../../src/libCom/iocsh -I../../../src/libCom/log -I../../../src/libCom/macLib -I../../../src/libCom/misc -I../../../src/libCom/osi -I../../../src/libCom/pool -I../../../src/libCom/ring -I../../../src/libCom/taskwd -I../../../src/libCom/timer -I../../../src/libCom/yacc -I../../../src/libCom/yacc -I../../../src/libCom/yajl -I../../../include/compiler/gcc -I../../../include/os/RTEMS -I../../../include         -MM -MF yajl_gen.d  ../../../src/libCom/yajl/yajl_gen.c
/usr/local/vw/rtems/rtems-4.10.2/bin/../libexec/gcc/m68k-rtems4.10.2/4.4.7/cc1: error while loading shared libraries: libmpfr.so.1: cannot open shared object file: No such file or directory
/usr/local/vw/rtems/rtems-4.10.2/bin/m68k-rtems4.10.2-gcc --pipe -B/usr/local/rtems/rtems-4.10.2/m68k-rtems4.10.2/uC5282/lib/ -specs bsp_specs -qrtems   -fasm   -mcpu=5282         -DUSE_TYPED_RSET         -DUNIX      -O2 -g -g   -Wall       -DMY_DO_BOOTP=NULL     -I. -I../O.Common -I. -I../../../src/libCom/osi/compiler/gcc -I../../../src/libCom/osi/compiler/default -I. -I../../../src/libCom/osi/os/RTEMS -I../../../src/libCom/osi/os/posix -I../../../src/libCom/osi/os/default -I.. -I../../../src/libCom/as -I../../../src/libCom/bucketLib -I../../../src/libCom/calc -I../../../src/libCom/cvtFast -I../../../src/libCom/cppStd -I../../../src/libCom/cxxTemplates -I../../../src/libCom/dbmf -I../../../src/libCom/ellLib -I../../../src/libCom/env -I../../../src/libCom/error -I../../../src/libCom/fdmgr -I../../../src/libCom/flex -I../../../src/libCom/freeList -I../../../src/libCom/gpHash -I../../../src/libCom/iocsh -I../../../src/libCom/log -I../../../src/libCom/macLib -I../../../src/libCom/misc -I../../../src/libCom/osi -I../../../src/libCom/pool -I../../../src/libCom/ring -I../../../src/libCom/taskwd -I../../../src/libCom/timer -I../../../src/libCom/yacc -I../../../src/libCom/yacc -I../../../src/libCom/yajl -I../../../include/compiler/gcc -I../../../include/os/RTEMS -I../../../include         -MM -MF yajl_encode.d  ../../../src/libCom/yajl/yajl_encode.c
/usr/local/vw/rtems/rtems-4.10.2/bin/../libexec/gcc/m68k-rtems4.10.2/4.4.7/cc1: error while loading shared libraries: libmpfr.so.1: cannot open shared object file: No such file or directory
/usr/local/vw/rtems/rtems-4.10.2/bin/m68k-rtems4.10.2-gcc --pipe -B/usr/local/rtems/rtems-4.10.2/m68k-rtems4.10.2/uC5282/lib/ -specs bsp_specs -qrtems   -fasm   -mcpu=5282         -DUSE_TYPED_RSET         -DUNIX      -O2 -g -g   -Wall       -DMY_DO_BOOTP=NULL     -I. -I../O.Common -I. -I../../../src/libCom/osi/compiler/gcc -I../../../src/libCom/osi/compiler/default -I. -I../../../src/libCom/osi/os/RTEMS -I../../../src/libCom/osi/os/posix -I../../../src/libCom/osi/os/default -I.. -I../../../src/libCom/as -I../../../src/libCom/bucketLib -I../../../src/libCom/calc -I../../../src/libCom/cvtFast -I../../../src/libCom/cppStd -I../../../src/libCom/cxxTemplates -I../../../src/libCom/dbmf -I../../../src/libCom/ellLib -I../../../src/libCom/env -I../../../src/libCom/error -I../../../src/libCom/fdmgr -I../../../src/libCom/flex -I../../../src/libCom/freeList -I../../../src/libCom/gpHash -I../../../src/libCom/iocsh -I../../../src/libCom/log -I../../../src/libCom/macLib -I../../../src/libCom/misc -I../../../src/libCom/osi -I../../../src/libCom/pool -I../../../src/libCom/ring -I../../../src/libCom/taskwd -I../../../src/libCom/timer -I../../../src/libCom/yacc -I../../../src/libCom/yacc -I../../../src/libCom/yajl -I../../../include/compiler/gcc -I../../../include/os/RTEMS -I../../../include         -MM -MF yajl_buf.d  ../../../src/libCom/yajl/yajl_buf.c
/usr/local/vw/rtems/rtems-4.10.2/bin/../libexec/gcc/m68k-rtems4.10.2/4.4.7/cc1: error while loading shared libraries: libmpfr.so.1: cannot open shared object file: No such file or directory
/usr/local/vw/rtems/rtems-4.10.2/bin/m68k-rtems4.10.2-gcc --pipe -B/usr/local/rtems/rtems-4.10.2/m68k-rtems4.10.2/uC5282/lib/ -specs bsp_specs -qrtems   -fasm   -mcpu=5282         -DUSE_TYPED_RSET         -DUNIX      -O2 -g -g   -Wall       -DMY_DO_BOOTP=NULL     -I. -I../O.Common -I. -I../../../src/libCom/osi/compiler/gcc -I../../../src/libCom/osi/compiler/default -I. -I../../../src/libCom/osi/os/RTEMS -I../../../src/libCom/osi/os/posix -I../../../src/libCom/osi/os/default -I.. -I../../../src/libCom/as -I../../../src/libCom/bucketLib -I../../../src/libCom/calc -I../../../src/libCom/cvtFast -I../../../src/libCom/cppStd -I../../../src/libCom/cxxTemplates -I../../../src/libCom/dbmf -I../../../src/libCom/ellLib -I../../../src/libCom/env -I../../../src/libCom/error -I../../../src/libCom/fdmgr -I../../../src/libCom/flex -I../../../src/libCom/freeList -I../../../src/libCom/gpHash -I../../../src/libCom/iocsh -I../../../src/libCom/log -I../../../src/libCom/macLib -I../../../src/libCom/misc -I../../../src/libCom/osi -I../../../src/libCom/pool -I../../../src/libCom/ring -I../../../src/libCom/taskwd -I../../../src/libCom/timer -I../../../src/libCom/yacc -I../../../src/libCom/yacc -I../../../src/libCom/yajl -I../../../include/compiler/gcc -I../../../include/os/RTEMS -I../../../include         -MM -MF yajl_alloc.d  ../../../src/libCom/yajl/yajl_alloc.c
/usr/local/vw/rtems/rtems-4.10.2/bin/../libexec/gcc/m68k-rtems4.10.2/4.4.7/cc1: error while loading shared libraries: libmpfr.so.1: cannot open shared object file: No such file or directory
/usr/local/vw/rtems/rtems-4.10.2/bin/m68k-rtems4.10.2-gcc --pipe -B/usr/local/rtems/rtems-4.10.2/m68k-rtems4.10.2/uC5282/lib/ -specs bsp_specs -qrtems   -fasm   -mcpu=5282         -DUSE_TYPED_RSET         -DUNIX      -O2 -g -g   -Wall       -DMY_DO_BOOTP=NULL     -I. -I../O.Common -I. -I../../../src/libCom/osi/compiler/gcc -I../../../src/libCom/osi/compiler/default -I. -I../../../src/libCom/osi/os/RTEMS -I../../../src/libCom/osi/os/posix -I../../../src/libCom/osi/os/default -I.. -I../../../src/libCom/as -I../../../src/libCom/bucketLib -I../../../src/libCom/calc -I../../../src/libCom/cvtFast -I../../../src/libCom/cppStd -I../../../src/libCom/cxxTemplates -I../../../src/libCom/dbmf -I../../../src/libCom/ellLib -I../../../src/libCom/env -I../../../src/libCom/error -I../../../src/libCom/fdmgr -I../../../src/libCom/flex -I../../../src/libCom/freeList -I../../../src/libCom/gpHash -I../../../src/libCom/iocsh -I../../../src/libCom/log -I../../../src/libCom/macLib -I../../../src/libCom/misc -I../../../src/libCom/osi -I../../../src/libCom/pool -I../../../src/libCom/ring -I../../../src/libCom/taskwd -I../../../src/libCom/timer -I../../../src/libCom/yacc -I../../../src/libCom/yacc -I../../../src/libCom/yajl -I../../../include/compiler/gcc -I../../../include/os/RTEMS -I../../../include         -MM -MF yajl.d  ../../../src/libCom/yajl/yajl.c
/usr/local/vw/rtems/rtems-4.10.2/bin/../libexec/gcc/m68k-rtems4.10.2/4.4.7/cc1: error while loading shared libraries: libmpfr.so.1: cannot open shared object file: No such file or directory
/usr/local/vw/rtems/rtems-4.10.2/bin/m68k-rtems4.10.2-g++ -B/usr/local/rtems/rtems-4.10.2/m68k-rtems4.10.2/uC5282/lib/ -specs bsp_specs -qrtems     -mcpu=5282         -DUSE_TYPED_RSET         -DUNIX      -O2 -g -g   -Wall       -DMY_DO_BOOTP=NULL     -I. -I../O.Common -I. -I../../../src/libCom/osi/compiler/gcc -I../../../src/libCom/osi/compiler/default -I. -I../../../src/libCom/osi/os/RTEMS -I../../../src/libCom/osi/os/posix -I../../../src/libCom/osi/os/default -I.. -I../../../src/libCom/as -I../../../src/libCom/bucketLib -I../../../src/libCom/calc -I../../../src/libCom/cvtFast -I../../../src/libCom/cppStd -I../../../src/libCom/cxxTemplates -I../../../src/libCom/dbmf -I../../../src/libCom/ellLib -I../../../src/libCom/env -I../../../src/libCom/error -I../../../src/libCom/fdmgr -I../../../src/libCom/flex -I../../../src/libCom/freeList -I../../../src/libCom/gpHash -I../../../src/libCom/iocsh -I../../../src/libCom/log -I../../../src/libCom/macLib -I../../../src/libCom/misc -I../../../src/libCom/osi -I../../../src/libCom/pool -I../../../src/libCom/ring -I../../../src/libCom/taskwd -I../../../src/libCom/timer -I../../../src/libCom/yacc -I../../../src/libCom/yacc -I../../../src/libCom/yajl -I../../../include/compiler/gcc -I../../../include/os/RTEMS -I../../../include         -MM -MF timerQueuePassive.d  ../../../src/libCom/timer/timerQueuePassive.cpp
/usr/local/vw/rtems/rtems-4.10.2/bin/../libexec/gcc/m68k-rtems4.10.2/4.4.7/cc1plus: error while loading shared libraries: libmpfr.so.1: cannot open shared object file: No such file or directory
/usr/local/vw/rtems/rtems-4.10.2/bin/m68k-rtems4.10.2-g++ -B/usr/local/rtems/rtems-4.10.2/m68k-rtems4.10.2/uC5282/lib/ -specs bsp_specs -qrtems     -mcpu=5282         -DUSE_TYPED_RSET         -DUNIX      -O2 -g -g   -Wall       -DMY_DO_BOOTP=NULL     -I. -I../O.Common -I. -I../../../src/libCom/osi/compiler/gcc -I../../../src/libCom/osi/compiler/default -I. -I../../../src/libCom/osi/os/RTEMS -I../../../src/libCom/osi/os/posix -I../../../src/libCom/osi/os/default -I.. -I../../../src/libCom/as -I../../../src/libCom/bucketLib -I../../../src/libCom/calc -I../../../src/libCom/cvtFast -I../../../src/libCom/cppStd -I../../../src/libCom/cxxTemplates -I../../../src/libCom/dbmf -I../../../src/libCom/ellLib -I../../../src/libCom/env -I../../../src/libCom/error -I../../../src/libCom/fdmgr -I../../../src/libCom/flex -I../../../src/libCom/freeList -I../../../src/libCom/gpHash -I../../../src/libCom/iocsh -I../../../src/libCom/log -I../../../src/libCom/macLib -I../../../src/libCom/misc -I../../../src/libCom/osi -I../../../src/libCom/pool -I../../../src/libCom/ring -I../../../src/libCom/taskwd -I../../../src/libCom/timer -I../../../src/libCom/yacc -I../../../src/libCom/yacc -I../../../src/libCom/yajl -I../../../include/compiler/gcc -I../../../include/os/RTEMS -I../../../include         -MM -MF timerQueueActiveMgr.d  ../../../src/libCom/timer/timerQueueActiveMgr.cpp
/usr/local/vw/rtems/rtems-4.10.2/bin/../libexec/gcc/m68k-rtems4.10.2/4.4.7/cc1plus: error while loading shared libraries: libmpfr.so.1: cannot open shared object file: No such file or directory
/usr/local/vw/rtems/rtems-4.10.2/bin/m68k-rtems4.10.2-g++ -B/usr/local/rtems/rtems-4.10.2/m68k-rtems4.10.2/uC5282/lib/ -specs bsp_specs -qrtems     -mcpu=5282         -DUSE_TYPED_RSET         -DUNIX      -O2 -g -g   -Wall       -DMY_DO_BOOTP=NULL     -I. -I../O.Common -I. -I../../../src/libCom/osi/compiler/gcc -I../../../src/libCom/osi/compiler/default -I. -I../../../src/libCom/osi/os/RTEMS -I../../../src/libCom/osi/os/posix -I../../../src/libCom/osi/os/default -I.. -I../../../src/libCom/as -I../../../src/libCom/bucketLib -I../../../src/libCom/calc -I../../../src/libCom/cvtFast -I../../../src/libCom/cppStd -I../../../src/libCom/cxxTemplates -I../../../src/libCom/dbmf -I../../../src/libCom/ellLib -I../../../src/libCom/env -I../../../src/libCom/error -I../../../src/libCom/fdmgr -I../../../src/libCom/flex -I../../../src/libCom/freeList -I../../../src/libCom/gpHash -I../../../src/libCom/iocsh -I../../../src/libCom/log -I../../../src/libCom/macLib -I../../../src/libCom/misc -I../../../src/libCom/osi -I../../../src/libCom/pool -I../../../src/libCom/ring -I../../../src/libCom/taskwd -I../../../src/libCom/timer -I../../../src/libCom/yacc -I../../../src/libCom/yacc -I../../../src/libCom/yajl -I../../../include/compiler/gcc -I../../../include/os/RTEMS -I../../../include         -MM -MF timerQueueActive.d  ../../../src/libCom/timer/timerQueueActive.cpp
/usr/local/vw/rtems/rtems-4.10.2/bin/../libexec/gcc/m68k-rtems4.10.2/4.4.7/cc1plus: error while loading shared libraries: libmpfr.so.1: cannot open shared object file: No such file or directory
/usr/local/vw/rtems/rtems-4.10.2/bin/m68k-rtems4.10.2-g++ -B/usr/local/rtems/rtems-4.10.2/m68k-rtems4.10.2/uC5282/lib/ -specs bsp_specs -qrtems     -mcpu=5282         -DUSE_TYPED_RSET         -DUNIX      -O2 -g -g   -Wall       -DMY_DO_BOOTP=NULL     -I. -I../O.Common -I. -I../../../src/libCom/osi/compiler/gcc -I../../../src/libCom/osi/compiler/default -I. -I../../../src/libCom/osi/os/RTEMS -I../../../src/libCom/osi/os/posix -I../../../src/libCom/osi/os/default -I.. -I../../../src/libCom/as -I../../../src/libCom/bucketLib -I../../../src/libCom/calc -I../../../src/libCom/cvtFast -I../../../src/libCom/cppStd -I../../../src/libCom/cxxTemplates -I../../../src/libCom/dbmf -I../../../src/libCom/ellLib -I../../../src/libCom/env -I../../../src/libCom/error -I../../../src/libCom/fdmgr -I../../../src/libCom/flex -I../../../src/libCom/freeList -I../../../src/libCom/gpHash -I../../../src/libCom/iocsh -I../../../src/libCom/log -I../../../src/libCom/macLib -I../../../src/libCom/misc -I../../../src/libCom/osi -I../../../src/libCom/pool -I../../../src/libCom/ring -I../../../src/libCom/taskwd -I../../../src/libCom/timer -I../../../src/libCom/yacc -I../../../src/libCom/yacc -I../../../src/libCom/yajl -I../../../include/compiler/gcc -I../../../include/os/RTEMS -I../../../include         -MM -MF timerQueue.d  ../../../src/libCom/timer/timerQueue.cpp
/usr/local/vw/rtems/rtems-4.10.2/bin/../libexec/gcc/m68k-rtems4.10.2/4.4.7/cc1plus: error while loading shared libraries: libmpfr.so.1: cannot open shared object file: No such file or directory
/usr/local/vw/rtems/rtems-4.10.2/bin/m68k-rtems4.10.2-g++ -B/usr/local/rtems/rtems-4.10.2/m68k-rtems4.10.2/uC5282/lib/ -specs bsp_specs -qrtems     -mcpu=5282         -DUSE_TYPED_RSET         -DUNIX      -O2 -g -g   -Wall       -DMY_DO_BOOTP=NULL     -I. -I../O.Common -I. -I../../../src/libCom/osi/compiler/gcc -I../../../src/libCom/osi/compiler/default -I. -I../../../src/libCom/osi/os/RTEMS -I../../../src/libCom/osi/os/posix -I../../../src/libCom/osi/os/default -I.. -I../../../src/libCom/as -I../../../src/libCom/bucketLib -I../../../src/libCom/calc -I../../../src/libCom/cvtFast -I../../../src/libCom/cppStd -I../../../src/libCom/cxxTemplates -I../../../src/libCom/dbmf -I../../../src/libCom/ellLib -I../../../src/libCom/env -I../../../src/libCom/error -I../../../src/libCom/fdmgr -I../../../src/libCom/flex -I../../../src/libCom/freeList -I../../../src/libCom/gpHash -I../../../src/libCom/iocsh -I../../../src/libCom/log -I../../../src/libCom/macLib -I../../../src/libCom/misc -I../../../src/libCom/osi -I../../../src/libCom/pool -I../../../src/libCom/ring -I../../../src/libCom/taskwd -I../../../src/libCom/timer -I../../../src/libCom/yacc -I../../../src/libCom/yacc -I../../../src/libCom/yajl -I../../../include/compiler/gcc -I../../../include/os/RTEMS -I../../../include         -MM -MF timer.d  ../../../src/libCom/timer/timer.cpp
/usr/local/vw/rtems/rtems-4.10.2/bin/../libexec/gcc/m68k-rtems4.10.2/4.4.7/cc1plus: error while loading shared libraries: libmpfr.so.1: cannot open shared object file: No such file or directory
/usr/local/vw/rtems/rtems-4.10.2/bin/m68k-rtems4.10.2-g++ -B/usr/local/rtems/rtems-4.10.2/m68k-rtems4.10.2/uC5282/lib/ -specs bsp_specs -qrtems     -mcpu=5282         -DUSE_TYPED_RSET         -DUNIX      -O2 -g -g   -Wall       -DMY_DO_BOOTP=NULL     -I. -I../O.Common -I. -I../../../src/libCom/osi/compiler/gcc -I../../../src/libCom/osi/compiler/default -I. -I../../../src/libCom/osi/os/RTEMS -I../../../src/libCom/osi/os/posix -I../../../src/libCom/osi/os/default -I.. -I../../../src/libCom/as -I../../../src/libCom/bucketLib -I../../../src/libCom/calc -I../../../src/libCom/cvtFast -I../../../src/libCom/cppStd -I../../../src/libCom/cxxTemplates -I../../../src/libCom/dbmf -I../../../src/libCom/ellLib -I../../../src/libCom/env -I../../../src/libCom/error -I../../../src/libCom/fdmgr -I../../../src/libCom/flex -I../../../src/libCom/freeList -I../../../src/libCom/gpHash -I../../../src/libCom/iocsh -I../../../src/libCom/log -I../../../src/libCom/macLib -I../../../src/libCom/misc -I../../../src/libCom/osi -I../../../src/libCom/pool -I../../../src/libCom/ring -I../../../src/libCom/taskwd -I../../../src/libCom/timer -I../../../src/libCom/yacc -I../../../src/libCom/yacc -I../../../src/libCom/yajl -I../../../include/compiler/gcc -I../../../include/os/RTEMS -I../../../include         -MM -MF epicsTimer.d  ../../../src/libCom/timer/epicsTimer.cpp
/usr/local/vw/rtems/rtems-4.10.2/bin/../libexec/gcc/m68k-rtems4.10.2/4.4.7/cc1plus: error while loading shared libraries: libmpfr.so.1: cannot open shared object file: No such file or directory
/usr/local/vw/rtems/rtems-4.10.2/bin/m68k-rtems4.10.2-gcc --pipe -B/usr/local/rtems/rtems-4.10.2/m68k-rtems4.10.2/uC5282/lib/ -specs bsp_specs -qrtems   -fasm   -mcpu=5282         -DUSE_TYPED_RSET         -DUNIX      -O2 -g -g   -Wall       -DMY_DO_BOOTP=NULL     -I. -I../O.Common -I. -I../../../src/libCom/osi/compiler/gcc -I../../../src/libCom/osi/compiler/default -I. -I../../../src/libCom/osi/os/RTEMS -I../../../src/libCom/osi/os/posix -I../../../src/libCom/osi/os/default -I.. -I../../../src/libCom/as -I../../../src/libCom/bucketLib -I../../../src/libCom/calc -I../../../src/libCom/cvtFast -I../../../src/libCom/cppStd -I../../../src/libCom/cxxTemplates -I../../../src/libCom/dbmf -I../../../src/libCom/ellLib -I../../../src/libCom/env -I../../../src/libCom/error -I../../../src/libCom/fdmgr -I../../../src/libCom/flex -I../../../src/libCom/freeList -I../../../src/libCom/gpHash -I../../../src/libCom/iocsh -I../../../src/libCom/log -I../../../src/libCom/macLib -I../../../src/libCom/misc -I../../../src/libCom/osi -I../../../src/libCom/pool -I../../../src/libCom/ring -I../../../src/libCom/taskwd -I../../../src/libCom/timer -I../../../src/libCom/yacc -I../../../src/libCom/yacc -I../../../src/libCom/yajl -I../../../include/compiler/gcc -I../../../include/os/RTEMS -I../../../include         -MM -MF taskwd.d  ../../../src/libCom/taskwd/taskwd.c
/usr/local/vw/rtems/rtems-4.10.2/bin/../libexec/gcc/m68k-rtems4.10.2/4.4.7/cc1: error while loading shared libraries: libmpfr.so.1: cannot open shared object file: No such file or directory
/usr/local/vw/rtems/rtems-4.10.2/bin/m68k-rtems4.10.2-gcc --pipe -B/usr/local/rtems/rtems-4.10.2/m68k-rtems4.10.2/uC5282/lib/ -specs bsp_specs -qrtems   -fasm   -mcpu=5282         -DUSE_TYPED_RSET         -DUNIX      -O2 -g -g   -Wall       -DMY_DO_BOOTP=NULL     -I. -I../O.Common -I. -I../../../src/libCom/osi/compiler/gcc -I../../../src/libCom/osi/compiler/default -I. -I../../../src/libCom/osi/os/RTEMS -I../../../src/libCom/osi/os/posix -I../../../src/libCom/osi/os/default -I.. -I../../../src/libCom/as -I../../../src/libCom/bucketLib -I../../../src/libCom/calc -I../../../src/libCom/cvtFast -I../../../src/libCom/cppStd -I../../../src/libCom/cxxTemplates -I../../../src/libCom/dbmf -I../../../src/libCom/ellLib -I../../../src/libCom/env -I../../../src/libCom/error -I../../../src/libCom/fdmgr -I../../../src/libCom/flex -I../../../src/libCom/freeList -I../../../src/libCom/gpHash -I../../../src/libCom/iocsh -I../../../src/libCom/log -I../../../src/libCom/macLib -I../../../src/libCom/misc -I../../../src/libCom/osi -I../../../src/libCom/pool -I../../../src/libCom/ring -I../../../src/libCom/taskwd -I../../../src/libCom/timer -I../../../src/libCom/yacc -I../../../src/libCom/yacc -I../../../src/libCom/yajl -I../../../include/compiler/gcc -I../../../include/os/RTEMS -I../../../include         -MM -MF epicsRingBytes.d  ../../../src/libCom/ring/epicsRingBytes.c
/usr/local/vw/rtems/rtems-4.10.2/bin/../libexec/gcc/m68k-rtems4.10.2/4.4.7/cc1: error while loading shared libraries: libmpfr.so.1: cannot open shared object file: No such file or directory
/usr/local/vw/rtems/rtems-4.10.2/bin/m68k-rtems4.10.2-g++ -B/usr/local/rtems/rtems-4.10.2/m68k-rtems4.10.2/uC5282/lib/ -specs bsp_specs -qrtems     -mcpu=5282         -DUSE_TYPED_RSET         -DUNIX      -O2 -g -g   -Wall       -DMY_DO_BOOTP=NULL     -I. -I../O.Common -I. -I../../../src/libCom/osi/compiler/gcc -I../../../src/libCom/osi/compiler/default -I. -I../../../src/libCom/osi/os/RTEMS -I../../../src/libCom/osi/os/posix -I../../../src/libCom/osi/os/default -I.. -I../../../src/libCom/as -I../../../src/libCom/bucketLib -I../../../src/libCom/calc -I../../../src/libCom/cvtFast -I../../../src/libCom/cppStd -I../../../src/libCom/cxxTemplates -I../../../src/libCom/dbmf -I../../../src/libCom/ellLib -I../../../src/libCom/env -I../../../src/libCom/error -I../../../src/libCom/fdmgr -I../../../src/libCom/flex -I../../../src/libCom/freeList -I../../../src/libCom/gpHash -I../../../src/libCom/iocsh -I../../../src/libCom/log -I../../../src/libCom/macLib -I../../../src/libCom/misc -I../../../src/libCom/osi -I../../../src/libCom/pool -I../../../src/libCom/ring -I../../../src/libCom/taskwd -I../../../src/libCom/timer -I../../../src/libCom/yacc -I../../../src/libCom/yacc -I../../../src/libCom/yajl -I../../../include/compiler/gcc -I../../../include/os/RTEMS -I../../../include         -MM -MF epicsRingPointer.d  ../../../src/libCom/ring/epicsRingPointer.cpp
/usr/local/vw/rtems/rtems-4.10.2/bin/../libexec/gcc/m68k-rtems4.10.2/4.4.7/cc1plus: error while loading shared libraries: libmpfr.so.1: cannot open shared object file: No such file or directory
/usr/local/vw/rtems/rtems-4.10.2/bin/m68k-rtems4.10.2-gcc --pipe -B/usr/local/rtems/rtems-4.10.2/m68k-rtems4.10.2/uC5282/lib/ -specs bsp_specs -qrtems   -fasm   -mcpu=5282         -DUSE_TYPED_RSET         -DUNIX      -O2 -g -g   -Wall       -DMY_DO_BOOTP=NULL     -I. -I../O.Common -I. -I../../../src/libCom/osi/compiler/gcc -I../../../src/libCom/osi/compiler/default -I. -I../../../src/libCom/osi/os/RTEMS -I../../../src/libCom/osi/os/posix -I../../../src/libCom/osi/os/default -I.. -I../../../src/libCom/as -I../../../src/libCom/bucketLib -I../../../src/libCom/calc -I../../../src/libCom/cvtFast -I../../../src/libCom/cppStd -I../../../src/libCom/cxxTemplates -I../../../src/libCom/dbmf -I../../../src/libCom/ellLib -I../../../src/libCom/env -I../../../src/libCom/error -I../../../src/libCom/fdmgr -I../../../src/libCom/flex -I../../../src/libCom/freeList -I../../../src/libCom/gpHash -I../../../src/libCom/iocsh -I../../../src/libCom/log -I../../../src/libCom/macLib -I../../../src/libCom/misc -I../../../src/libCom/osi -I../../../src/libCom/pool -I../../../src/libCom/ring -I../../../src/libCom/taskwd -I../../../src/libCom/timer -I../../../src/libCom/yacc -I../../../src/libCom/yacc -I../../../src/libCom/yajl -I../../../include/compiler/gcc -I../../../include/os/RTEMS -I../../../include         -MM -MF threadPool.d  ../../../src/libCom/pool/threadPool.c
/usr/local/vw/rtems/rtems-4.10.2/bin/../libexec/gcc/m68k-rtems4.10.2/4.4.7/cc1: error while loading shared libraries: libmpfr.so.1: cannot open shared object file: No such file or directory
/usr/local/vw/rtems/rtems-4.10.2/bin/m68k-rtems4.10.2-gcc --pipe -B/usr/local/rtems/rtems-4.10.2/m68k-rtems4.10.2/uC5282/lib/ -specs bsp_specs -qrtems   -fasm   -mcpu=5282         -DUSE_TYPED_RSET         -DUNIX      -O2 -g -g   -Wall       -DMY_DO_BOOTP=NULL     -I. -I../O.Common -I. -I../../../src/libCom/osi/compiler/gcc -I../../../src/libCom/osi/compiler/default -I. -I../../../src/libCom/osi/os/RTEMS -I../../../src/libCom/osi/os/posix -I../../../src/libCom/osi/os/default -I.. -I../../../src/libCom/as -I../../../src/libCom/bucketLib -I../../../src/libCom/calc -I../../../src/libCom/cvtFast -I../../../src/libCom/cppStd -I../../../src/libCom/cxxTemplates -I../../../src/libCom/dbmf -I../../../src/libCom/ellLib -I../../../src/libCom/env -I../../../src/libCom/error -I../../../src/libCom/fdmgr -I../../../src/libCom/flex -I../../../src/libCom/freeList -I../../../src/libCom/gpHash -I../../../src/libCom/iocsh -I../../../src/libCom/log -I../../../src/libCom/macLib -I../../../src/libCom/misc -I../../../src/libCom/osi -I../../../src/libCom/pool -I../../../src/libCom/ring -I../../../src/libCom/taskwd -I../../../src/libCom/timer -I../../../src/libCom/yacc -I../../../src/libCom/yacc -I../../../src/libCom/yajl -I../../../include/compiler/gcc -I../../../include/os/RTEMS -I../../../include         -MM -MF poolJob.d  ../../../src/libCom/pool/poolJob.c
/usr/local/vw/rtems/rtems-4.10.2/bin/../libexec/gcc/m68k-rtems4.10.2/4.4.7/cc1: error while loading shared libraries: libmpfr.so.1: cannot open shared object file: No such file or directory
/usr/local/vw/rtems/rtems-4.10.2/bin/m68k-rtems4.10.2-gcc --pipe -B/usr/local/rtems/rtems-4.10.2/m68k-rtems4.10.2/uC5282/lib/ -specs bsp_specs -qrtems   -fasm   -mcpu=5282         -DUSE_TYPED_RSET         -DUNIX      -O2 -g -g   -Wall       -DMY_DO_BOOTP=NULL     -I. -I../O.Common -I. -I../../../src/libCom/osi/compiler/gcc -I../../../src/libCom/osi/compiler/default -I. -I../../../src/libCom/osi/os/RTEMS -I../../../src/libCom/osi/os/posix -I../../../src/libCom/osi/os/default -I.. -I../../../src/libCom/as -I../../../src/libCom/bucketLib -I../../../src/libCom/calc -I../../../src/libCom/cvtFast -I../../../src/libCom/cppStd -I../../../src/libCom/cxxTemplates -I../../../src/libCom/dbmf -I../../../src/libCom/ellLib -I../../../src/libCom/env -I../../../src/libCom/error -I../../../src/libCom/fdmgr -I../../../src/libCom/flex -I../../../src/libCom/freeList -I../../../src/libCom/gpHash -I../../../src/libCom/iocsh -I../../../src/libCom/log -I../../../src/libCom/macLib -I../../../src/libCom/misc -I../../../src/libCom/osi -I../../../src/libCom/pool -I../../../src/libCom/ring -I../../../src/libCom/taskwd -I../../../src/libCom/timer -I../../../src/libCom/yacc -I../../../src/libCom/yacc -I../../../src/libCom/yajl -I../../../include/compiler/gcc -I../../../include/os/RTEMS -I../../../include         -MM -MF osdFindAddr.d  ../../../src/libCom/osi/os/default/osdFindAddr.c
/usr/local/vw/rtems/rtems-4.10.2/bin/../libexec/gcc/m68k-rtems4.10.2/4.4.7/cc1: error while loading shared libraries: libmpfr.so.1: cannot open shared object file: No such file or directory
/usr/local/vw/rtems/rtems-4.10.2/bin/m68k-rtems4.10.2-g++ -B/usr/local/rtems/rtems-4.10.2/m68k-rtems4.10.2/uC5282/lib/ -specs bsp_specs -qrtems     -mcpu=5282         -DUSE_TYPED_RSET         -DUNIX      -O2 -g -g   -Wall       -DMY_DO_BOOTP=NULL     -I. -I../O.Common -I. -I../../../src/libCom/osi/compiler/gcc -I../../../src/libCom/osi/compiler/default -I. -I../../../src/libCom/osi/os/RTEMS -I../../../src/libCom/osi/os/posix -I../../../src/libCom/osi/os/default -I.. -I../../../src/libCom/as -I../../../src/libCom/bucketLib -I../../../src/libCom/calc -I../../../src/libCom/cvtFast -I../../../src/libCom/cppStd -I../../../src/libCom/cxxTemplates -I../../../src/libCom/dbmf -I../../../src/libCom/ellLib -I../../../src/libCom/env -I../../../src/libCom/error -I../../../src/libCom/fdmgr -I../../../src/libCom/flex -I../../../src/libCom/freeList -I../../../src/libCom/gpHash -I../../../src/libCom/iocsh -I../../../src/libCom/log -I../../../src/libCom/macLib -I../../../src/libCom/misc -I../../../src/libCom/osi -I../../../src/libCom/pool -I../../../src/libCom/ring -I../../../src/libCom/taskwd -I../../../src/libCom/timer -I../../../src/libCom/yacc -I../../../src/libCom/yacc -I../../../src/libCom/yajl -I../../../include/compiler/gcc -I../../../include/os/RTEMS -I../../../include         -MM -MF osdBackTrace.d  ../../../src/libCom/osi/os/default/osdBackTrace.cpp
/usr/local/vw/rtems/rtems-4.10.2/bin/../libexec/gcc/m68k-rtems4.10.2/4.4.7/cc1plus: error while loading shared libraries: libmpfr.so.1: cannot open shared object file: No such file or directory
/usr/local/vw/rtems/rtems-4.10.2/bin/m68k-rtems4.10.2-gcc --pipe -B/usr/local/rtems/rtems-4.10.2/m68k-rtems4.10.2/uC5282/lib/ -specs bsp_specs -qrtems   -fasm   -mcpu=5282         -DUSE_TYPED_RSET         -DUNIX      -O2 -g -g   -Wall       -DMY_DO_BOOTP=NULL     -I. -I../O.Common -I. -I../../../src/libCom/osi/compiler/gcc -I../../../src/libCom/osi/compiler/default -I. -I../../../src/libCom/osi/os/RTEMS -I../../../src/libCom/osi/os/posix -I../../../src/libCom/osi/os/default -I.. -I../../../src/libCom/as -I../../../src/libCom/bucketLib -I../../../src/libCom/calc -I../../../src/libCom/cvtFast -I../../../src/libCom/cppStd -I../../../src/libCom/cxxTemplates -I../../../src/libCom/dbmf -I../../../src/libCom/ellLib -I../../../src/libCom/env -I../../../src/libCom/error -I../../../src/libCom/fdmgr -I../../../src/libCom/flex -I../../../src/libCom/freeList -I../../../src/libCom/gpHash -I../../../src/libCom/iocsh -I../../../src/libCom/log -I../../../src/libCom/macLib -I../../../src/libCom/misc -I../../../src/libCom/osi -I../../../src/libCom/pool -I../../../src/libCom/ring -I../../../src/libCom/taskwd -I../../../src/libCom/timer -I../../../src/libCom/yacc -I../../../src/libCom/yacc -I../../../src/libCom/yajl -I../../../include/compiler/gcc -I../../../include/os/RTEMS -I../../../include         -MM -MF epicsStackTrace.d  ../../../src/libCom/osi/epicsStackTrace.c
/usr/local/vw/rtems/rtems-4.10.2/bin/../libexec/gcc/m68k-rtems4.10.2/4.4.7/cc1: error while loading shared libraries: libmpfr.so.1: cannot open shared object file: No such file or directory
/usr/local/vw/rtems/rtems-4.10.2/bin/m68k-rtems4.10.2-gcc --pipe -B/usr/local/rtems/rtems-4.10.2/m68k-rtems4.10.2/uC5282/lib/ -specs bsp_specs -qrtems   -fasm   -mcpu=5282         -DUSE_TYPED_RSET         -DUNIX      -O2 -g -g   -Wall       -DMY_DO_BOOTP=NULL     -I. -I../O.Common -I. -I../../../src/libCom/osi/compiler/gcc -I../../../src/libCom/osi/compiler/default -I. -I../../../src/libCom/osi/os/RTEMS -I../../../src/libCom/osi/os/posix -I../../../src/libCom/osi/os/default -I.. -I../../../src/libCom/as -I../../../src/libCom/bucketLib -I../../../src/libCom/calc -I../../../src/libCom/cvtFast -I../../../src/libCom/cppStd -I../../../src/libCom/cxxTemplates -I../../../src/libCom/dbmf -I../../../src/libCom/ellLib -I../../../src/libCom/env -I../../../src/libCom/error -I../../../src/libCom/fdmgr -I../../../src/libCom/flex -I../../../src/libCom/freeList -I../../../src/libCom/gpHash -I../../../src/libCom/iocsh -I../../../src/libCom/log -I../../../src/libCom/macLib -I../../../src/libCom/misc -I../../../src/libCom/osi -I../../../src/libCom/pool -I../../../src/libCom/ring -I../../../src/libCom/taskwd -I../../../src/libCom/timer -I../../../src/libCom/yacc -I../../../src/libCom/yacc -I../../../src/libCom/yajl -I../../../include/compiler/gcc -I../../../include/os/RTEMS -I../../../include         -MM -MF devLibVMEOSD.d  ../../../src/libCom/osi/os/RTEMS/devLibVMEOSD.c
/usr/local/vw/rtems/rtems-4.10.2/bin/../libexec/gcc/m68k-rtems4.10.2/4.4.7/cc1: error while loading shared libraries: libmpfr.so.1: cannot open shared object file: No such file or directory
/usr/local/vw/rtems/rtems-4.10.2/bin/m68k-rtems4.10.2-gcc --pipe -B/usr/local/rtems/rtems-4.10.2/m68k-rtems4.10.2/uC5282/lib/ -specs bsp_specs -qrtems   -fasm   -mcpu=5282         -DUSE_TYPED_RSET         -DUNIX      -O2 -g -g   -Wall       -DMY_DO_BOOTP=NULL     -I. -I../O.Common -I. -I../../../src/libCom/osi/compiler/gcc -I../../../src/libCom/osi/compiler/default -I. -I../../../src/libCom/osi/os/RTEMS -I../../../src/libCom/osi/os/posix -I../../../src/libCom/osi/os/default -I.. -I../../../src/libCom/as -I../../../src/libCom/bucketLib -I../../../src/libCom/calc -I../../../src/libCom/cvtFast -I../../../src/libCom/cppStd -I../../../src/libCom/cxxTemplates -I../../../src/libCom/dbmf -I../../../src/libCom/ellLib -I../../../src/libCom/env -I../../../src/libCom/error -I../../../src/libCom/fdmgr -I../../../src/libCom/flex -I../../../src/libCom/freeList -I../../../src/libCom/gpHash -I../../../src/libCom/iocsh -I../../../src/libCom/log -I../../../src/libCom/macLib -I../../../src/libCom/misc -I../../../src/libCom/osi -I../../../src/libCom/pool -I../../../src/libCom/ring -I../../../src/libCom/taskwd -I../../../src/libCom/timer -I../../../src/libCom/yacc -I../../../src/libCom/yacc -I../../../src/libCom/yajl -I../../../include/compiler/gcc -I../../../include/os/RTEMS -I../../../include         -MM -MF devLibVME.d  ../../../src/libCom/osi/devLibVME.c
/usr/local/vw/rtems/rtems-4.10.2/bin/../libexec/gcc/m68k-rtems4.10.2/4.4.7/cc1: error while loading shared libraries: libmpfr.so.1: cannot open shared object file: No such file or directory
/usr/local/vw/rtems/rtems-4.10.2/bin/m68k-rtems4.10.2-gcc --pipe -B/usr/local/rtems/rtems-4.10.2/m68k-rtems4.10.2/uC5282/lib/ -specs bsp_specs -qrtems   -fasm   -mcpu=5282         -DUSE_TYPED_RSET         -DUNIX      -O2 -g -g   -Wall       -DMY_DO_BOOTP=NULL     -I. -I../O.Common -I. -I../../../src/libCom/osi/compiler/gcc -I../../../src/libCom/osi/compiler/default -I. -I../../../src/libCom/osi/os/RTEMS -I../../../src/libCom/osi/os/posix -I../../../src/libCom/osi/os/default -I.. -I../../../src/libCom/as -I../../../src/libCom/bucketLib -I../../../src/libCom/calc -I../../../src/libCom/cvtFast -I../../../src/libCom/cppStd -I../../../src/libCom/cxxTemplates -I../../../src/libCom/dbmf -I../../../src/libCom/ellLib -I../../../src/libCom/env -I../../../src/libCom/error -I../../../src/libCom/fdmgr -I../../../src/libCom/flex -I../../../src/libCom/freeList -I../../../src/libCom/gpHash -I../../../src/libCom/iocsh -I../../../src/libCom/log -I../../../src/libCom/macLib -I../../../src/libCom/misc -I../../../src/libCom/osi -I../../../src/libCom/pool -I../../../src/libCom/ring -I../../../src/libCom/taskwd -I../../../src/libCom/timer -I../../../src/libCom/yacc -I../../../src/libCom/yacc -I../../../src/libCom/yajl -I../../../include/compiler/gcc -I../../../include/os/RTEMS -I../../../include         -MM -MF osdMessageQueue.d  ../../../src/libCom/osi/os/RTEMS/osdMessageQueue.c
/usr/local/vw/rtems/rtems-4.10.2/bin/../libexec/gcc/m68k-rtems4.10.2/4.4.7/cc1: error while loading shared libraries: libmpfr.so.1: cannot open shared object file: No such file or directory
/usr/local/vw/rtems/rtems-4.10.2/bin/m68k-rtems4.10.2-gcc --pipe -B/usr/local/rtems/rtems-4.10.2/m68k-rtems4.10.2/uC5282/lib/ -specs bsp_specs -qrtems   -fasm   -mcpu=5282         -DUSE_TYPED_RSET         -DUNIX      -O2 -g -g   -Wall       -DMY_DO_BOOTP=NULL     -I. -I../O.Common -I. -I../../../src/libCom/osi/compiler/gcc -I../../../src/libCom/osi/compiler/default -I. -I../../../src/libCom/osi/os/RTEMS -I../../../src/libCom/osi/os/posix -I../../../src/libCom/osi/os/default -I.. -I../../../src/libCom/as -I../../../src/libCom/bucketLib -I../../../src/libCom/calc -I../../../src/libCom/cvtFast -I../../../src/libCom/cppStd -I../../../src/libCom/cxxTemplates -I../../../src/libCom/dbmf -I../../../src/libCom/ellLib -I../../../src/libCom/env -I../../../src/libCom/error -I../../../src/libCom/fdmgr -I../../../src/libCom/flex -I../../../src/libCom/freeList -I../../../src/libCom/gpHash -I../../../src/libCom/iocsh -I../../../src/libCom/log -I../../../src/libCom/macLib -I../../../src/libCom/misc -I../../../src/libCom/osi -I../../../src/libCom/pool -I../../../src/libCom/ring -I../../../src/libCom/taskwd -I../../../src/libCom/timer -I../../../src/libCom/yacc -I../../../src/libCom/yacc -I../../../src/libCom/yajl -I../../../include/compiler/gcc -I../../../include/os/RTEMS -I../../../include         -MM -MF osdNetIntf.d  ../../../src/libCom/osi/os/default/osdNetIntf.c
/usr/local/vw/rtems/rtems-4.10.2/bin/../libexec/gcc/m68k-rtems4.10.2/4.4.7/cc1: error while loading shared libraries: libmpfr.so.1: cannot open shared object file: No such file or directory
/usr/local/vw/rtems/rtems-4.10.2/bin/m68k-rtems4.10.2-gcc --pipe -B/usr/local/rtems/rtems-4.10.2/m68k-rtems4.10.2/uC5282/lib/ -specs bsp_specs -qrtems   -fasm   -mcpu=5282         -DUSE_TYPED_RSET         -DUNIX      -O2 -g -g   -Wall       -DMY_DO_BOOTP=NULL     -I. -I../O.Common -I. -I../../../src/libCom/osi/compiler/gcc -I../../../src/libCom/osi/compiler/default -I. -I../../../src/libCom/osi/os/RTEMS -I../../../src/libCom/osi/os/posix -I../../../src/libCom/osi/os/default -I.. -I../../../src/libCom/as -I../../../src/libCom/bucketLib -I../../../src/libCom/calc -I../../../src/libCom/cvtFast -I../../../src/libCom/cppStd -I../../../src/libCom/cxxTemplates -I../../../src/libCom/dbmf -I../../../src/libCom/ellLib -I../../../src/libCom/env -I../../../src/libCom/error -I../../../src/libCom/fdmgr -I../../../src/libCom/flex -I../../../src/libCom/freeList -I../../../src/libCom/gpHash -I../../../src/libCom/iocsh -I../../../src/libCom/log -I../../../src/libCom/macLib -I../../../src/libCom/misc -I../../../src/libCom/osi -I../../../src/libCom/pool -I../../../src/libCom/ring -I../../../src/libCom/taskwd -I../../../src/libCom/timer -I../../../src/libCom/yacc -I../../../src/libCom/yacc -I../../../src/libCom/yajl -I../../../include/compiler/gcc -I../../../include/os/RTEMS -I../../../include         -MM -MF osdProcess.d  ../../../src/libCom/osi/os/RTEMS/osdProcess.c
/usr/local/vw/rtems/rtems-4.10.2/bin/../libexec/gcc/m68k-rtems4.10.2/4.4.7/cc1: error while loading shared libraries: libmpfr.so.1: cannot open shared object file: No such file or directory
/usr/local/vw/rtems/rtems-4.10.2/bin/m68k-rtems4.10.2-g++ -B/usr/local/rtems/rtems-4.10.2/m68k-rtems4.10.2/uC5282/lib/ -specs bsp_specs -qrtems     -mcpu=5282         -DUSE_TYPED_RSET         -DUNIX      -O2 -g -g   -Wall       -DMY_DO_BOOTP=NULL     -I. -I../O.Common -I. -I../../../src/libCom/osi/compiler/gcc -I../../../src/libCom/osi/compiler/default -I. -I../../../src/libCom/osi/os/RTEMS -I../../../src/libCom/osi/os/posix -I../../../src/libCom/osi/os/default -I.. -I../../../src/libCom/as -I../../../src/libCom/bucketLib -I../../../src/libCom/calc -I../../../src/libCom/cvtFast -I../../../src/libCom/cppStd -I../../../src/libCom/cxxTemplates -I../../../src/libCom/dbmf -I../../../src/libCom/ellLib -I../../../src/libCom/env -I../../../src/libCom/error -I../../../src/libCom/fdmgr -I../../../src/libCom/flex -I../../../src/libCom/freeList -I../../../src/libCom/gpHash -I../../../src/libCom/iocsh -I../../../src/libCom/log -I../../../src/libCom/macLib -I../../../src/libCom/misc -I../../../src/libCom/osi -I../../../src/libCom/pool -I../../../src/libCom/ring -I../../../src/libCom/taskwd -I../../../src/libCom/timer -I../../../src/libCom/yacc -I../../../src/libCom/yacc -I../../../src/libCom/yajl -I../../../include/compiler/gcc -I../../../include/os/RTEMS -I../../../include         -MM -MF osdTime.d  ../../../src/libCom/osi/os/RTEMS/osdTime.cpp
/usr/local/vw/rtems/rtems-4.10.2/bin/../libexec/gcc/m68k-rtems4.10.2/4.4.7/cc1plus: error while loading shared libraries: libmpfr.so.1: cannot open shared object file: No such file or directory
/usr/local/vw/rtems/rtems-4.10.2/bin/m68k-rtems4.10.2-gcc --pipe -B/usr/local/rtems/rtems-4.10.2/m68k-rtems4.10.2/uC5282/lib/ -specs bsp_specs -qrtems   -fasm   -mcpu=5282         -DUSE_TYPED_RSET         -DUNIX      -O2 -g -g   -Wall       -DMY_DO_BOOTP=NULL     -I. -I../O.Common -I. -I../../../src/libCom/osi/compiler/gcc -I../../../src/libCom/osi/compiler/default -I. -I../../../src/libCom/osi/os/RTEMS -I../../../src/libCom/osi/os/posix -I../../../src/libCom/osi/os/default -I.. -I../../../src/libCom/as -I../../../src/libCom/bucketLib -I../../../src/libCom/calc -I../../../src/libCom/cvtFast -I../../../src/libCom/cppStd -I../../../src/libCom/cxxTemplates -I../../../src/libCom/dbmf -I../../../src/libCom/ellLib -I../../../src/libCom/env -I../../../src/libCom/error -I../../../src/libCom/fdmgr -I../../../src/libCom/flex -I../../../src/libCom/freeList -I../../../src/libCom/gpHash -I../../../src/libCom/iocsh -I../../../src/libCom/log -I../../../src/libCom/macLib -I../../../src/libCom/misc -I../../../src/libCom/osi -I../../../src/libCom/pool -I../../../src/libCom/ring -I../../../src/libCom/taskwd -I../../../src/libCom/timer -I../../../src/libCom/yacc -I../../../src/libCom/yacc -I../../../src/libCom/yajl -I../../../include/compiler/gcc -I../../../include/os/RTEMS -I../../../include         -MM -MF osdEvent.d  ../../../src/libCom/osi/os/RTEMS/osdEvent.c
/usr/local/vw/rtems/rtems-4.10.2/bin/../libexec/gcc/m68k-rtems4.10.2/4.4.7/cc1: error while loading shared libraries: libmpfr.so.1: cannot open shared object file: No such file or directory
/usr/local/vw/rtems/rtems-4.10.2/bin/m68k-rtems4.10.2-gcc --pipe -B/usr/local/rtems/rtems-4.10.2/m68k-rtems4.10.2/uC5282/lib/ -specs bsp_specs -qrtems   -fasm   -mcpu=5282         -DUSE_TYPED_RSET         -DUNIX      -O2 -g -g   -Wall       -DMY_DO_BOOTP=NULL     -I. -I../O.Common -I. -I../../../src/libCom/osi/compiler/gcc -I../../../src/libCom/osi/compiler/default -I. -I../../../src/libCom/osi/os/RTEMS -I../../../src/libCom/osi/os/posix -I../../../src/libCom/osi/os/default -I.. -I../../../src/libCom/as -I../../../src/libCom/bucketLib -I../../../src/libCom/calc -I../../../src/libCom/cvtFast -I../../../src/libCom/cppStd -I../../../src/libCom/cxxTemplates -I../../../src/libCom/dbmf -I../../../src/libCom/ellLib -I../../../src/libCom/env -I../../../src/libCom/error -I../../../src/libCom/fdmgr -I../../../src/libCom/flex -I../../../src/libCom/freeList -I../../../src/libCom/gpHash -I../../../src/libCom/iocsh -I../../../src/libCom/log -I../../../src/libCom/macLib -I../../../src/libCom/misc -I../../../src/libCom/osi -I../../../src/libCom/pool -I../../../src/libCom/ring -I../../../src/libCom/taskwd -I../../../src/libCom/timer -I../../../src/libCom/yacc -I../../../src/libCom/yacc -I../../../src/libCom/yajl -I../../../include/compiler/gcc -I../../../include/os/RTEMS -I../../../include         -MM -MF osdSpin.d  ../../../src/libCom/osi/os/RTEMS/osdSpin.c
/usr/local/vw/rtems/rtems-4.10.2/bin/../libexec/gcc/m68k-rtems4.10.2/4.4.7/cc1: error while loading shared libraries: libmpfr.so.1: cannot open shared object file: No such file or directory
/usr/local/vw/rtems/rtems-4.10.2/bin/m68k-rtems4.10.2-gcc --pipe -B/usr/local/rtems/rtems-4.10.2/m68k-rtems4.10.2/uC5282/lib/ -specs bsp_specs -qrtems   -fasm   -mcpu=5282         -DUSE_TYPED_RSET         -DUNIX      -O2 -g -g   -Wall       -DMY_DO_BOOTP=NULL     -I. -I../O.Common -I. -I../../../src/libCom/osi/compiler/gcc -I../../../src/libCom/osi/compiler/default -I. -I../../../src/libCom/osi/os/RTEMS -I../../../src/libCom/osi/os/posix -I../../../src/libCom/osi/os/default -I.. -I../../../src/libCom/as -I../../../src/libCom/bucketLib -I../../../src/libCom/calc -I../../../src/libCom/cvtFast -I../../../src/libCom/cppStd -I../../../src/libCom/cxxTemplates -I../../../src/libCom/dbmf -I../../../src/libCom/ellLib -I../../../src/libCom/env -I../../../src/libCom/error -I../../../src/libCom/fdmgr -I../../../src/libCom/flex -I../../../src/libCom/freeList -I../../../src/libCom/gpHash -I../../../src/libCom/iocsh -I../../../src/libCom/log -I../../../src/libCom/macLib -I../../../src/libCom/misc -I../../../src/libCom/osi -I../../../src/libCom/pool -I../../../src/libCom/ring -I../../../src/libCom/taskwd -I../../../src/libCom/timer -I../../../src/libCom/yacc -I../../../src/libCom/yacc -I../../../src/libCom/yajl -I../../../include/compiler/gcc -I../../../include/os/RTEMS -I../../../include         -MM -MF osdMutex.d  ../../../src/libCom/osi/os/RTEMS/osdMutex.c
/usr/local/vw/rtems/rtems-4.10.2/bin/../libexec/gcc/m68k-rtems4.10.2/4.4.7/cc1: error while loading shared libraries: libmpfr.so.1: cannot open shared object file: No such file or directory
/usr/local/vw/rtems/rtems-4.10.2/bin/m68k-rtems4.10.2-gcc --pipe -B/usr/local/rtems/rtems-4.10.2/m68k-rtems4.10.2/uC5282/lib/ -specs bsp_specs -qrtems   -fasm   -mcpu=5282         -DUSE_TYPED_RSET         -DUNIX      -O2 -g -g   -Wall       -DMY_DO_BOOTP=NULL     -I. -I../O.Common -I. -I../../../src/libCom/osi/compiler/gcc -I../../../src/libCom/osi/compiler/default -I. -I../../../src/libCom/osi/os/RTEMS -I../../../src/libCom/osi/os/posix -I../../../src/libCom/osi/os/default -I.. -I../../../src/libCom/as -I../../../src/libCom/bucketLib -I../../../src/libCom/calc -I../../../src/libCom/cvtFast -I../../../src/libCom/cppStd -I../../../src/libCom/cxxTemplates -I../../../src/libCom/dbmf -I../../../src/libCom/ellLib -I../../../src/libCom/env -I../../../src/libCom/error -I../../../src/libCom/fdmgr -I../../../src/libCom/flex -I../../../src/libCom/freeList -I../../../src/libCom/gpHash -I../../../src/libCom/iocsh -I../../../src/libCom/log -I../../../src/libCom/macLib -I../../../src/libCom/misc -I../../../src/libCom/osi -I../../../src/libCom/pool -I../../../src/libCom/ring -I../../../src/libCom/taskwd -I../../../src/libCom/timer -I../../../src/libCom/yacc -I../../../src/libCom/yacc -I../../../src/libCom/yajl -I../../../include/compiler/gcc -I../../../include/os/RTEMS -I../../../include         -MM -MF osdThreadHooks.d  ../../../src/libCom/osi/os/default/osdThreadHooks.c
/usr/local/vw/rtems/rtems-4.10.2/bin/../libexec/gcc/m68k-rtems4.10.2/4.4.7/cc1: error while loading shared libraries: libmpfr.so.1: cannot open shared object file: No such file or directory
/usr/local/vw/rtems/rtems-4.10.2/bin/m68k-rtems4.10.2-gcc --pipe -B/usr/local/rtems/rtems-4.10.2/m68k-rtems4.10.2/uC5282/lib/ -specs bsp_specs -qrtems   -fasm   -mcpu=5282         -DUSE_TYPED_RSET         -DUNIX      -O2 -g -g   -Wall       -DMY_DO_BOOTP=NULL     -I. -I../O.Common -I. -I../../../src/libCom/osi/compiler/gcc -I../../../src/libCom/osi/compiler/default -I. -I../../../src/libCom/osi/os/RTEMS -I../../../src/libCom/osi/os/posix -I../../../src/libCom/osi/os/default -I.. -I../../../src/libCom/as -I../../../src/libCom/bucketLib -I../../../src/libCom/calc -I../../../src/libCom/cvtFast -I../../../src/libCom/cppStd -I../../../src/libCom/cxxTemplates -I../../../src/libCom/dbmf -I../../../src/libCom/ellLib -I../../../src/libCom/env -I../../../src/libCom/error -I../../../src/libCom/fdmgr -I../../../src/libCom/flex -I../../../src/libCom/freeList -I../../../src/libCom/gpHash -I../../../src/libCom/iocsh -I../../../src/libCom/log -I../../../src/libCom/macLib -I../../../src/libCom/misc -I../../../src/libCom/osi -I../../../src/libCom/pool -I../../../src/libCom/ring -I../../../src/libCom/taskwd -I../../../src/libCom/timer -I../../../src/libCom/yacc -I../../../src/libCom/yacc -I../../../src/libCom/yajl -I../../../include/compiler/gcc -I../../../include/os/RTEMS -I../../../include         -MM -MF osdThreadExtra.d  ../../../src/libCom/osi/os/RTEMS/osdThreadExtra.c
/usr/local/vw/rtems/rtems-4.10.2/bin/../libexec/gcc/m68k-rtems4.10.2/4.4.7/cc1: error while loading shared libraries: libmpfr.so.1: cannot open shared object file: No such file or directory
/usr/local/vw/rtems/rtems-4.10.2/bin/m68k-rtems4.10.2-gcc --pipe -B/usr/local/rtems/rtems-4.10.2/m68k-rtems4.10.2/uC5282/lib/ -specs bsp_specs -qrtems   -fasm   -mcpu=5282         -DUSE_TYPED_RSET         -DUNIX      -O2 -g -g   -Wall       -DMY_DO_BOOTP=NULL     -I. -I../O.Common -I. -I../../../src/libCom/osi/compiler/gcc -I../../../src/libCom/osi/compiler/default -I. -I../../../src/libCom/osi/os/RTEMS -I../../../src/libCom/osi/os/posix -I../../../src/libCom/osi/os/default -I.. -I../../../src/libCom/as -I../../../src/libCom/bucketLib -I../../../src/libCom/calc -I../../../src/libCom/cvtFast -I../../../src/libCom/cppStd -I../../../src/libCom/cxxTemplates -I../../../src/libCom/dbmf -I../../../src/libCom/ellLib -I../../../src/libCom/env -I../../../src/libCom/error -I../../../src/libCom/fdmgr -I../../../src/libCom/flex -I../../../src/libCom/freeList -I../../../src/libCom/gpHash -I../../../src/libCom/iocsh -I../../../src/libCom/log -I../../../src/libCom/macLib -I../../../src/libCom/misc -I../../../src/libCom/osi -I../../../src/libCom/pool -I../../../src/libCom/ring -I../../../src/libCom/taskwd -I../../../src/libCom/timer -I../../../src/libCom/yacc -I../../../src/libCom/yacc -I../../../src/libCom/yajl -I../../../include/compiler/gcc -I../../../include/os/RTEMS -I../../../include         -MM -MF osdThread.d  ../../../src/libCom/osi/os/RTEMS/osdThread.c
/usr/local/vw/rtems/rtems-4.10.2/bin/../libexec/gcc/m68k-rtems4.10.2/4.4.7/cc1: error while loading shared libraries: libmpfr.so.1: cannot open shared object file: No such file or directory
/usr/local/vw/rtems/rtems-4.10.2/bin/m68k-rtems4.10.2-gcc --pipe -B/usr/local/rtems/rtems-4.10.2/m68k-rtems4.10.2/uC5282/lib/ -specs bsp_specs -qrtems   -fasm   -mcpu=5282         -DUSE_TYPED_RSET         -DUNIX      -O2 -g -g   -Wall       -DMY_DO_BOOTP=NULL     -I. -I../O.Common -I. -I../../../src/libCom/osi/compiler/gcc -I../../../src/libCom/osi/compiler/default -I. -I../../../src/libCom/osi/os/RTEMS -I../../../src/libCom/osi/os/posix -I../../../src/libCom/osi/os/default -I.. -I../../../src/libCom/as -I../../../src/libCom/bucketLib -I../../../src/libCom/calc -I../../../src/libCom/cvtFast -I../../../src/libCom/cppStd -I../../../src/libCom/cxxTemplates -I../../../src/libCom/dbmf -I../../../src/libCom/ellLib -I../../../src/libCom/env -I../../../src/libCom/error -I../../../src/libCom/fdmgr -I../../../src/libCom/flex -I../../../src/libCom/freeList -I../../../src/libCom/gpHash -I../../../src/libCom/iocsh -I../../../src/libCom/log -I../../../src/libCom/macLib -I../../../src/libCom/misc -I../../../src/libCom/osi -I../../../src/libCom/pool -I../../../src/libCom/ring -I../../../src/libCom/taskwd -I../../../src/libCom/timer -I../../../src/libCom/yacc -I../../../src/libCom/yacc -I../../../src/libCom/yajl -I../../../include/compiler/gcc -I../../../include/os/RTEMS -I../../../include         -MM -MF osdStdio.d  ../../../src/libCom/osi/os/posix/osdStdio.c
/usr/local/vw/rtems/rtems-4.10.2/bin/../libexec/gcc/m68k-rtems4.10.2/4.4.7/cc1: error while loading shared libraries: libmpfr.so.1: cannot open shared object file: No such file or directory
/usr/local/vw/rtems/rtems-4.10.2/bin/m68k-rtems4.10.2-gcc --pipe -B/usr/local/rtems/rtems-4.10.2/m68k-rtems4.10.2/uC5282/lib/ -specs bsp_specs -qrtems   -fasm   -mcpu=5282         -DUSE_TYPED_RSET         -DUNIX      -O2 -g -g   -Wall       -DMY_DO_BOOTP=NULL     -I. -I../O.Common -I. -I../../../src/libCom/osi/compiler/gcc -I../../../src/libCom/osi/compiler/default -I. -I../../../src/libCom/osi/os/RTEMS -I../../../src/libCom/osi/os/posix -I../../../src/libCom/osi/os/default -I.. -I../../../src/libCom/as -I../../../src/libCom/bucketLib -I../../../src/libCom/calc -I../../../src/libCom/cvtFast -I../../../src/libCom/cppStd -I../../../src/libCom/cxxTemplates -I../../../src/libCom/dbmf -I../../../src/libCom/ellLib -I../../../src/libCom/env -I../../../src/libCom/error -I../../../src/libCom/fdmgr -I../../../src/libCom/flex -I../../../src/libCom/freeList -I../../../src/libCom/gpHash -I../../../src/libCom/iocsh -I../../../src/libCom/log -I../../../src/libCom/macLib -I../../../src/libCom/misc -I../../../src/libCom/osi -I../../../src/libCom/pool -I../../../src/libCom/ring -I../../../src/libCom/taskwd -I../../../src/libCom/timer -I../../../src/libCom/yacc -I../../../src/libCom/yacc -I../../../src/libCom/yajl -I../../../include/compiler/gcc -I../../../include/os/RTEMS -I../../../include         -MM -MF epicsStdio.d  ../../../src/libCom/osi/epicsStdio.c
/usr/local/vw/rtems/rtems-4.10.2/bin/../libexec/gcc/m68k-rtems4.10.2/4.4.7/cc1: error while loading shared libraries: libmpfr.so.1: cannot open shared object file: No such file or directory
/usr/local/vw/rtems/rtems-4.10.2/bin/m68k-rtems4.10.2-g++ -B/usr/local/rtems/rtems-4.10.2/m68k-rtems4.10.2/uC5282/lib/ -specs bsp_specs -qrtems     -mcpu=5282         -DUSE_TYPED_RSET         -DUNIX      -O2 -g -g   -Wall       -DMY_DO_BOOTP=NULL     -I. -I../O.Common -I. -I../../../src/libCom/osi/compiler/gcc -I../../../src/libCom/osi/compiler/default -I. -I../../../src/libCom/osi/os/RTEMS -I../../../src/libCom/osi/os/posix -I../../../src/libCom/osi/os/default -I.. -I../../../src/libCom/as -I../../../src/libCom/bucketLib -I../../../src/libCom/calc -I../../../src/libCom/cvtFast -I../../../src/libCom/cppStd -I../../../src/libCom/cxxTemplates -I../../../src/libCom/dbmf -I../../../src/libCom/ellLib -I../../../src/libCom/env -I../../../src/libCom/error -I../../../src/libCom/fdmgr -I../../../src/libCom/flex -I../../../src/libCom/freeList -I../../../src/libCom/gpHash -I../../../src/libCom/iocsh -I../../../src/libCom/log -I../../../src/libCom/macLib -I../../../src/libCom/misc -I../../../src/libCom/osi -I../../../src/libCom/pool -I../../../src/libCom/ring -I../../../src/libCom/taskwd -I../../../src/libCom/timer -I../../../src/libCom/yacc -I../../../src/libCom/yacc -I../../../src/libCom/yajl -I../../../include/compiler/gcc -I../../../include/os/RTEMS -I../../../include         -MM -MF epicsTempFile.d  ../../../src/libCom/osi/os/posix/epicsTempFile.cpp
/usr/local/vw/rtems/rtems-4.10.2/bin/../libexec/gcc/m68k-rtems4.10.2/4.4.7/cc1plus: error while loading shared libraries: libmpfr.so.1: cannot open shared object file: No such file or directory
/usr/local/vw/rtems/rtems-4.10.2/bin/m68k-rtems4.10.2-gcc --pipe -B/usr/local/rtems/rtems-4.10.2/m68k-rtems4.10.2/uC5282/lib/ -specs bsp_specs -qrtems   -fasm   -mcpu=5282         -DUSE_TYPED_RSET         -DUNIX      -O2 -g -g   -Wall   -DEPICS_COMMANDLINE_LIBRARY=EPICS_COMMANDLINE_LIBRARY_READLINE    -DMY_DO_BOOTP=NULL     -I. -I../O.Common -I. -I../../../src/libCom/osi/compiler/gcc -I../../../src/libCom/osi/compiler/default -I. -I../../../src/libCom/osi/os/RTEMS -I../../../src/libCom/osi/os/posix -I../../../src/libCom/osi/os/default -I.. -I../../../src/libCom/as -I../../../src/libCom/bucketLib -I../../../src/libCom/calc -I../../../src/libCom/cvtFast -I../../../src/libCom/cppStd -I../../../src/libCom/cxxTemplates -I../../../src/libCom/dbmf -I../../../src/libCom/ellLib -I../../../src/libCom/env -I../../../src/libCom/error -I../../../src/libCom/fdmgr -I../../../src/libCom/flex -I../../../src/libCom/freeList -I../../../src/libCom/gpHash -I../../../src/libCom/iocsh -I../../../src/libCom/log -I../../../src/libCom/macLib -I../../../src/libCom/misc -I../../../src/libCom/osi -I../../../src/libCom/pool -I../../../src/libCom/ring -I../../../src/libCom/taskwd -I../../../src/libCom/timer -I../../../src/libCom/yacc -I../../../src/libCom/yacc -I../../../src/libCom/yajl -I../../../include/compiler/gcc -I../../../include/os/RTEMS -I../../../include         -MM -MF epicsReadline.d  ../../../src/libCom/osi/epicsReadline.c
/usr/local/vw/rtems/rtems-4.10.2/bin/../libexec/gcc/m68k-rtems4.10.2/4.4.7/cc1: error while loading shared libraries: libmpfr.so.1: cannot open shared object file: No such file or directory
/usr/local/vw/rtems/rtems-4.10.2/bin/m68k-rtems4.10.2-gcc --pipe -B/usr/local/rtems/rtems-4.10.2/m68k-rtems4.10.2/uC5282/lib/ -specs bsp_specs -qrtems   -fasm   -mcpu=5282         -DUSE_TYPED_RSET         -DUNIX      -O2 -g -g   -Wall       -DMY_DO_BOOTP=NULL     -I. -I../O.Common -I. -I../../../src/libCom/osi/compiler/gcc -I../../../src/libCom/osi/compiler/default -I. -I../../../src/libCom/osi/os/RTEMS -I../../../src/libCom/osi/os/posix -I../../../src/libCom/osi/os/default -I.. -I../../../src/libCom/as -I../../../src/libCom/bucketLib -I../../../src/libCom/calc -I../../../src/libCom/cvtFast -I../../../src/libCom/cppStd -I../../../src/libCom/cxxTemplates -I../../../src/libCom/dbmf -I../../../src/libCom/ellLib -I../../../src/libCom/env -I../../../src/libCom/error -I../../../src/libCom/fdmgr -I../../../src/libCom/flex -I../../../src/libCom/freeList -I../../../src/libCom/gpHash -I../../../src/libCom/iocsh -I../../../src/libCom/log -I../../../src/libCom/macLib -I../../../src/libCom/misc -I../../../src/libCom/osi -I../../../src/libCom/pool -I../../../src/libCom/ring -I../../../src/libCom/taskwd -I../../../src/libCom/timer -I../../../src/libCom/yacc -I../../../src/libCom/yacc -I../../../src/libCom/yajl -I../../../include/compiler/gcc -I../../../include/os/RTEMS -I../../../include         -MM -MF osdEnv.d  ../../../src/libCom/osi/os/default/osdEnv.c
/usr/local/vw/rtems/rtems-4.10.2/bin/../libexec/gcc/m68k-rtems4.10.2/4.4.7/cc1: error while loading shared libraries: libmpfr.so.1: cannot open shared object file: No such file or directory
/usr/local/vw/rtems/rtems-4.10.2/bin/m68k-rtems4.10.2-g++ -B/usr/local/rtems/rtems-4.10.2/m68k-rtems4.10.2/uC5282/lib/ -specs bsp_specs -qrtems     -mcpu=5282         -DUSE_TYPED_RSET         -DUNIX      -O2 -g -g   -Wall       -DMY_DO_BOOTP=NULL     -I. -I../O.Common -I. -I../../../src/libCom/osi/compiler/gcc -I../../../src/libCom/osi/compiler/default -I. -I../../../src/libCom/osi/os/RTEMS -I../../../src/libCom/osi/os/posix -I../../../src/libCom/osi/os/default -I.. -I../../../src/libCom/as -I../../../src/libCom/bucketLib -I../../../src/libCom/calc -I../../../src/libCom/cvtFast -I../../../src/libCom/cppStd -I../../../src/libCom/cxxTemplates -I../../../src/libCom/dbmf -I../../../src/libCom/ellLib -I../../../src/libCom/env -I../../../src/libCom/error -I../../../src/libCom/fdmgr -I../../../src/libCom/flex -I../../../src/libCom/freeList -I../../../src/libCom/gpHash -I../../../src/libCom/iocsh -I../../../src/libCom/log -I../../../src/libCom/macLib -I../../../src/libCom/misc -I../../../src/libCom/osi -I../../../src/libCom/pool -I../../../src/libCom/ring -I../../../src/libCom/taskwd -I../../../src/libCom/timer -I../../../src/libCom/yacc -I../../../src/libCom/yacc -I../../../src/libCom/yajl -I../../../include/compiler/gcc -I../../../include/os/RTEMS -I../../../include         -MM -MF osdSignal.d  ../../../src/libCom/osi/os/RTEMS/osdSignal.cpp
/usr/local/vw/rtems/rtems-4.10.2/bin/../libexec/gcc/m68k-rtems4.10.2/4.4.7/cc1plus: error while loading shared libraries: libmpfr.so.1: cannot open shared object file: No such file or directory
/usr/local/vw/rtems/rtems-4.10.2/bin/m68k-rtems4.10.2-gcc --pipe -B/usr/local/rtems/rtems-4.10.2/m68k-rtems4.10.2/uC5282/lib/ -specs bsp_specs -qrtems   -fasm   -mcpu=5282         -DUSE_TYPED_RSET         -DUNIX      -O2 -g -g   -Wall       -DMY_DO_BOOTP=NULL     -I. -I../O.Common -I. -I../../../src/libCom/osi/compiler/gcc -I../../../src/libCom/osi/compiler/default -I. -I../../../src/libCom/osi/os/RTEMS -I../../../src/libCom/osi/os/posix -I../../../src/libCom/osi/os/default -I.. -I../../../src/libCom/as -I../../../src/libCom/bucketLib -I../../../src/libCom/calc -I../../../src/libCom/cvtFast -I../../../src/libCom/cppStd -I../../../src/libCom/cxxTemplates -I../../../src/libCom/dbmf -I../../../src/libCom/ellLib -I../../../src/libCom/env -I../../../src/libCom/error -I../../../src/libCom/fdmgr -I../../../src/libCom/flex -I../../../src/libCom/freeList -I../../../src/libCom/gpHash -I../../../src/libCom/iocsh -I../../../src/libCom/log -I../../../src/libCom/macLib -I../../../src/libCom/misc -I../../../src/libCom/osi -I../../../src/libCom/pool -I../../../src/libCom/ring -I../../../src/libCom/taskwd -I../../../src/libCom/timer -I../../../src/libCom/yacc -I../../../src/libCom/yacc -I../../../src/libCom/yajl -I../../../include/compiler/gcc -I../../../include/os/RTEMS -I../../../include         -MM -MF osdPoolStatus.d  ../../../src/libCom/osi/os/RTEMS/osdPoolStatus.c
/usr/local/vw/rtems/rtems-4.10.2/bin/../libexec/gcc/m68k-rtems4.10.2/4.4.7/cc1: error while loading shared libraries: libmpfr.so.1: cannot open shared object file: No such file or directory
/usr/local/vw/rtems/rtems-4.10.2/bin/m68k-rtems4.10.2-gcc --pipe -B/usr/local/rtems/rtems-4.10.2/m68k-rtems4.10.2/uC5282/lib/ -specs bsp_specs -qrtems   -fasm   -mcpu=5282         -DUSE_TYPED_RSET         -DUNIX      -O2 -g -g   -Wall       -DMY_DO_BOOTP=NULL     -I. -I../O.Common -I. -I../../../src/libCom/osi/compiler/gcc -I../../../src/libCom/osi/compiler/default -I. -I../../../src/libCom/osi/os/RTEMS -I../../../src/libCom/osi/os/posix -I../../../src/libCom/osi/os/default -I.. -I../../../src/libCom/as -I../../../src/libCom/bucketLib -I../../../src/libCom/calc -I../../../src/libCom/cvtFast -I../../../src/libCom/cppStd -I../../../src/libCom/cxxTemplates -I../../../src/libCom/dbmf -I../../../src/libCom/ellLib -I../../../src/libCom/env -I../../../src/libCom/error -I../../../src/libCom/fdmgr -I../../../src/libCom/flex -I../../../src/libCom/freeList -I../../../src/libCom/gpHash -I../../../src/libCom/iocsh -I../../../src/libCom/log -I../../../src/libCom/macLib -I../../../src/libCom/misc -I../../../src/libCom/osi -I../../../src/libCom/pool -I../../../src/libCom/ring -I../../../src/libCom/taskwd -I../../../src/libCom/timer -I../../../src/libCom/yacc -I../../../src/libCom/yacc -I../../../src/libCom/yajl -I../../../include/compiler/gcc -I../../../include/os/RTEMS -I../../../include         -MM -MF osdInterrupt.d  ../../../src/libCom/osi/os/RTEMS/osdInterrupt.c
/usr/local/vw/rtems/rtems-4.10.2/bin/../libexec/gcc/m68k-rtems4.10.2/4.4.7/cc1: error while loading shared libraries: libmpfr.so.1: cannot open shared object file: No such file or directory
/usr/local/vw/rtems/rtems-4.10.2/bin/m68k-rtems4.10.2-gcc --pipe -B/usr/local/rtems/rtems-4.10.2/m68k-rtems4.10.2/uC5282/lib/ -specs bsp_specs -qrtems   -fasm   -mcpu=5282         -DUSE_TYPED_RSET         -DUNIX      -O2 -g -g   -Wall       -DMY_DO_BOOTP=NULL     -I. -I../O.Common -I. -I../../../src/libCom/osi/compiler/gcc -I../../../src/libCom/osi/compiler/default -I. -I../../../src/libCom/osi/os/RTEMS -I../../../src/libCom/osi/os/posix -I../../../src/libCom/osi/os/default -I.. -I../../../src/libCom/as -I../../../src/libCom/bucketLib -I../../../src/libCom/calc -I../../../src/libCom/cvtFast -I../../../src/libCom/cppStd -I../../../src/libCom/cxxTemplates -I../../../src/libCom/dbmf -I../../../src/libCom/ellLib -I../../../src/libCom/env -I../../../src/libCom/error -I../../../src/libCom/fdmgr -I../../../src/libCom/flex -I../../../src/libCom/freeList -I../../../src/libCom/gpHash -I../../../src/libCom/iocsh -I../../../src/libCom/log -I../../../src/libCom/macLib -I../../../src/libCom/misc -I../../../src/libCom/osi -I../../../src/libCom/pool -I../../../src/libCom/ring -I../../../src/libCom/taskwd -I../../../src/libCom/timer -I../../../src/libCom/yacc -I../../../src/libCom/yacc -I../../../src/libCom/yajl -I../../../include/compiler/gcc -I../../../include/os/RTEMS -I../../../include         -MM -MF osdFindSymbol.d  ../../../src/libCom/osi/os/RTEMS/osdFindSymbol.c
/usr/local/vw/rtems/rtems-4.10.2/bin/../libexec/gcc/m68k-rtems4.10.2/4.4.7/cc1: error while loading shared libraries: libmpfr.so.1: cannot open shared object file: No such file or directory
/usr/local/vw/rtems/rtems-4.10.2/bin/m68k-rtems4.10.2-gcc --pipe -B/usr/local/rtems/rtems-4.10.2/m68k-rtems4.10.2/uC5282/lib/ -specs bsp_specs -qrtems   -fasm   -mcpu=5282         -DUSE_TYPED_RSET         -DUNIX      -O2 -g -g   -Wall       -DMY_DO_BOOTP=NULL     -I. -I../O.Common -I. -I../../../src/libCom/osi/compiler/gcc -I../../../src/libCom/osi/compiler/default -I. -I../../../src/libCom/osi/os/RTEMS -I../../../src/libCom/osi/os/posix -I../../../src/libCom/osi/os/default -I.. -I../../../src/libCom/as -I../../../src/libCom/bucketLib -I../../../src/libCom/calc -I../../../src/libCom/cvtFast -I../../../src/libCom/cppStd -I../../../src/libCom/cxxTemplates -I../../../src/libCom/dbmf -I../../../src/libCom/ellLib -I../../../src/libCom/env -I../../../src/libCom/error -I../../../src/libCom/fdmgr -I../../../src/libCom/flex -I../../../src/libCom/freeList -I../../../src/libCom/gpHash -I../../../src/libCom/iocsh -I../../../src/libCom/log -I../../../src/libCom/macLib -I../../../src/libCom/misc -I../../../src/libCom/osi -I../../../src/libCom/pool -I../../../src/libCom/ring -I../../../src/libCom/taskwd -I../../../src/libCom/timer -I../../../src/libCom/yacc -I../../../src/libCom/yacc -I../../../src/libCom/yajl -I../../../include/compiler/gcc -I../../../include/os/RTEMS -I../../../include         -MM -MF osdAssert.d  ../../../src/libCom/osi/os/default/osdAssert.c
/usr/local/vw/rtems/rtems-4.10.2/bin/../libexec/gcc/m68k-rtems4.10.2/4.4.7/cc1: error while loading shared libraries: libmpfr.so.1: cannot open shared object file: No such file or directory
/usr/local/vw/rtems/rtems-4.10.2/bin/m68k-rtems4.10.2-g++ -B/usr/local/rtems/rtems-4.10.2/m68k-rtems4.10.2/uC5282/lib/ -specs bsp_specs -qrtems     -mcpu=5282         -DUSE_TYPED_RSET         -DUNIX      -O2 -g -g   -Wall       -DMY_DO_BOOTP=NULL     -I. -I../O.Common -I. -I../../../src/libCom/osi/compiler/gcc -I../../../src/libCom/osi/compiler/default -I. -I../../../src/libCom/osi/os/RTEMS -I../../../src/libCom/osi/os/posix -I../../../src/libCom/osi/os/default -I.. -I../../../src/libCom/as -I../../../src/libCom/bucketLib -I../../../src/libCom/calc -I../../../src/libCom/cvtFast -I../../../src/libCom/cppStd -I../../../src/libCom/cxxTemplates -I../../../src/libCom/dbmf -I../../../src/libCom/ellLib -I../../../src/libCom/env -I../../../src/libCom/error -I../../../src/libCom/fdmgr -I../../../src/libCom/flex -I../../../src/libCom/freeList -I../../../src/libCom/gpHash -I../../../src/libCom/iocsh -I../../../src/libCom/log -I../../../src/libCom/macLib -I../../../src/libCom/misc -I../../../src/libCom/osi -I../../../src/libCom/pool -I../../../src/libCom/ring -I../../../src/libCom/taskwd -I../../../src/libCom/timer -I../../../src/libCom/yacc -I../../../src/libCom/yacc -I../../../src/libCom/yajl -I../../../include/compiler/gcc -I../../../include/os/RTEMS -I../../../include         -MM -MF epicsSocketConvertErrnoToString.d  ../../../src/libCom/osi/os/default/epicsSocketConvertErrnoToString.cpp
/usr/local/vw/rtems/rtems-4.10.2/bin/../libexec/gcc/m68k-rtems4.10.2/4.4.7/cc1plus: error while loading shared libraries: libmpfr.so.1: cannot open shared object file: No such file or directory
/usr/local/vw/rtems/rtems-4.10.2/bin/m68k-rtems4.10.2-g++ -B/usr/local/rtems/rtems-4.10.2/m68k-rtems4.10.2/uC5282/lib/ -specs bsp_specs -qrtems     -mcpu=5282         -DUSE_TYPED_RSET         -DUNIX      -O2 -g -g   -Wall       -DMY_DO_BOOTP=NULL     -I. -I../O.Common -I. -I../../../src/libCom/osi/compiler/gcc -I../../../src/libCom/osi/compiler/default -I. -I../../../src/libCom/osi/os/RTEMS -I../../../src/libCom/osi/os/posix -I../../../src/libCom/osi/os/default -I.. -I../../../src/libCom/as -I../../../src/libCom/bucketLib -I../../../src/libCom/calc -I../../../src/libCom/cvtFast -I../../../src/libCom/cppStd -I../../../src/libCom/cxxTemplates -I../../../src/libCom/dbmf -I../../../src/libCom/ellLib -I../../../src/libCom/env -I../../../src/libCom/error -I../../../src/libCom/fdmgr -I../../../src/libCom/flex -I../../../src/libCom/freeList -I../../../src/libCom/gpHash -I../../../src/libCom/iocsh -I../../../src/libCom/log -I../../../src/libCom/macLib -I../../../src/libCom/misc -I../../../src/libCom/osi -I../../../src/libCom/pool -I../../../src/libCom/ring -I../../../src/libCom/taskwd -I../../../src/libCom/timer -I../../../src/libCom/yacc -I../../../src/libCom/yacc -I../../../src/libCom/yajl -I../../../include/compiler/gcc -I../../../include/os/RTEMS -I../../../include         -MM -MF systemCallIntMech.d  ../../../src/libCom/osi/os/posix/systemCallIntMech.cpp
/usr/local/vw/rtems/rtems-4.10.2/bin/../libexec/gcc/m68k-rtems4.10.2/4.4.7/cc1plus: error while loading shared libraries: libmpfr.so.1: cannot open shared object file: No such file or directory
/usr/local/vw/rtems/rtems-4.10.2/bin/m68k-rtems4.10.2-gcc --pipe -B/usr/local/rtems/rtems-4.10.2/m68k-rtems4.10.2/uC5282/lib/ -specs bsp_specs -qrtems   -fasm   -mcpu=5282         -DUSE_TYPED_RSET         -DUNIX      -O2 -g -g   -Wall       -DMY_DO_BOOTP=NULL     -I. -I../O.Common -I. -I../../../src/libCom/osi/compiler/gcc -I../../../src/libCom/osi/compiler/default -I. -I../../../src/libCom/osi/os/RTEMS -I../../../src/libCom/osi/os/posix -I../../../src/libCom/osi/os/default -I.. -I../../../src/libCom/as -I../../../src/libCom/bucketLib -I../../../src/libCom/calc -I../../../src/libCom/cvtFast -I../../../src/libCom/cppStd -I../../../src/libCom/cxxTemplates -I../../../src/libCom/dbmf -I../../../src/libCom/ellLib -I../../../src/libCom/env -I../../../src/libCom/error -I../../../src/libCom/fdmgr -I../../../src/libCom/flex -I../../../src/libCom/freeList -I../../../src/libCom/gpHash -I../../../src/libCom/iocsh -I../../../src/libCom/log -I../../../src/libCom/macLib -I../../../src/libCom/misc -I../../../src/libCom/osi -I../../../src/libCom/pool -I../../../src/libCom/ring -I../../../src/libCom/taskwd -I../../../src/libCom/timer -I../../../src/libCom/yacc -I../../../src/libCom/yacc -I../../../src/libCom/yajl -I../../../include/compiler/gcc -I../../../include/os/RTEMS -I../../../include         -MM -MF osiSock.d  ../../../src/libCom/osi/osiSock.c
/usr/local/vw/rtems/rtems-4.10.2/bin/../libexec/gcc/m68k-rtems4.10.2/4.4.7/cc1: error while loading shared libraries: libmpfr.so.1: cannot open shared object file: No such file or directory
/usr/local/vw/rtems/rtems-4.10.2/bin/m68k-rtems4.10.2-g++ -B/usr/local/rtems/rtems-4.10.2/m68k-rtems4.10.2/uC5282/lib/ -specs bsp_specs -qrtems     -mcpu=5282         -DUSE_TYPED_RSET         -DUNIX      -O2 -g -g   -Wall       -DMY_DO_BOOTP=NULL     -I. -I../O.Common -I. -I../../../src/libCom/osi/compiler/gcc -I../../../src/libCom/osi/compiler/default -I. -I../../../src/libCom/osi/os/RTEMS -I../../../src/libCom/osi/os/posix -I../../../src/libCom/osi/os/default -I.. -I../../../src/libCom/as -I../../../src/libCom/bucketLib -I../../../src/libCom/calc -I../../../src/libCom/cvtFast -I../../../src/libCom/cppStd -I../../../src/libCom/cxxTemplates -I../../../src/libCom/dbmf -I../../../src/libCom/ellLib -I../../../src/libCom/env -I../../../src/libCom/error -I../../../src/libCom/fdmgr -I../../../src/libCom/flex -I../../../src/libCom/freeList -I../../../src/libCom/gpHash -I../../../src/libCom/iocsh -I../../../src/libCom/log -I../../../src/libCom/macLib -I../../../src/libCom/misc -I../../../src/libCom/osi -I../../../src/libCom/pool -I../../../src/libCom/ring -I../../../src/libCom/taskwd -I../../../src/libCom/timer -I../../../src/libCom/yacc -I../../../src/libCom/yacc -I../../../src/libCom/yajl -I../../../include/compiler/gcc -I../../../include/os/RTEMS -I../../../include         -MM -MF osdSockAddrReuse.d  ../../../src/libCom/osi/os/posix/osdSockAddrReuse.cpp
/usr/local/vw/rtems/rtems-4.10.2/bin/../libexec/gcc/m68k-rtems4.10.2/4.4.7/cc1plus: error while loading shared libraries: libmpfr.so.1: cannot open shared object file: No such file or directory
/usr/local/vw/rtems/rtems-4.10.2/bin/m68k-rtems4.10.2-gcc --pipe -B/usr/local/rtems/rtems-4.10.2/m68k-rtems4.10.2/uC5282/lib/ -specs bsp_specs -qrtems   -fasm   -mcpu=5282         -DUSE_TYPED_RSET         -DUNIX      -O2 -g -g   -Wall       -DMY_DO_BOOTP=NULL     -I. -I../O.Common -I. -I../../../src/libCom/osi/compiler/gcc -I../../../src/libCom/osi/compiler/default -I. -I../../../src/libCom/osi/os/RTEMS -I../../../src/libCom/osi/os/posix -I../../../src/libCom/osi/os/default -I.. -I../../../src/libCom/as -I../../../src/libCom/bucketLib -I../../../src/libCom/calc -I../../../src/libCom/cvtFast -I../../../src/libCom/cppStd -I../../../src/libCom/cxxTemplates -I../../../src/libCom/dbmf -I../../../src/libCom/ellLib -I../../../src/libCom/env -I../../../src/libCom/error -I../../../src/libCom/fdmgr -I../../../src/libCom/flex -I../../../src/libCom/freeList -I../../../src/libCom/gpHash -I../../../src/libCom/iocsh -I../../../src/libCom/log -I../../../src/libCom/macLib -I../../../src/libCom/misc -I../../../src/libCom/osi -I../../../src/libCom/pool -I../../../src/libCom/ring -I../../../src/libCom/taskwd -I../../../src/libCom/timer -I../../../src/libCom/yacc -I../../../src/libCom/yacc -I../../../src/libCom/yajl -I../../../include/compiler/gcc -I../../../include/os/RTEMS -I../../../include         -MM -MF osdSock.d  ../../../src/libCom/osi/os/posix/osdSock.c
/usr/local/vw/rtems/rtems-4.10.2/bin/../libexec/gcc/m68k-rtems4.10.2/4.4.7/cc1: error while loading shared libraries: libmpfr.so.1: cannot open shared object file: No such file or directory
/usr/local/vw/rtems/rtems-4.10.2/bin/m68k-rtems4.10.2-gcc --pipe -B/usr/local/rtems/rtems-4.10.2/m68k-rtems4.10.2/uC5282/lib/ -specs bsp_specs -qrtems   -fasm   -mcpu=5282         -DUSE_TYPED_RSET         -DUNIX      -O2 -g -g   -Wall       -DMY_DO_BOOTP=NULL     -I. -I../O.Common -I. -I../../../src/libCom/osi/compiler/gcc -I../../../src/libCom/osi/compiler/default -I. -I../../../src/libCom/osi/os/RTEMS -I../../../src/libCom/osi/os/posix -I../../../src/libCom/osi/os/default -I.. -I../../../src/libCom/as -I../../../src/libCom/bucketLib -I../../../src/libCom/calc -I../../../src/libCom/cvtFast -I../../../src/libCom/cppStd -I../../../src/libCom/cxxTemplates -I../../../src/libCom/dbmf -I../../../src/libCom/ellLib -I../../../src/libCom/env -I../../../src/libCom/error -I../../../src/libCom/fdmgr -I../../../src/libCom/flex -I../../../src/libCom/freeList -I../../../src/libCom/gpHash -I../../../src/libCom/iocsh -I../../../src/libCom/log -I../../../src/libCom/macLib -I../../../src/libCom/misc -I../../../src/libCom/osi -I../../../src/libCom/pool -I../../../src/libCom/ring -I../../../src/libCom/taskwd -I../../../src/libCom/timer -I../../../src/libCom/yacc -I../../../src/libCom/yacc -I../../../src/libCom/yajl -I../../../include/compiler/gcc -I../../../include/os/RTEMS -I../../../include         -MM -MF osiClockTime.d  ../../../src/libCom/osi/osiClockTime.c
/usr/local/vw/rtems/rtems-4.10.2/bin/../libexec/gcc/m68k-rtems4.10.2/4.4.7/cc1: error while loading shared libraries: libmpfr.so.1: cannot open shared object file: No such file or directory
/usr/local/vw/rtems/rtems-4.10.2/bin/m68k-rtems4.10.2-gcc --pipe -B/usr/local/rtems/rtems-4.10.2/m68k-rtems4.10.2/uC5282/lib/ -specs bsp_specs -qrtems   -fasm   -mcpu=5282         -DUSE_TYPED_RSET         -DUNIX      -O2 -g -g   -Wall       -DMY_DO_BOOTP=NULL     -I. -I../O.Common -I. -I../../../src/libCom/osi/compiler/gcc -I../../../src/libCom/osi/compiler/default -I. -I../../../src/libCom/osi/os/RTEMS -I../../../src/libCom/osi/os/posix -I../../../src/libCom/osi/os/default -I.. -I../../../src/libCom/as -I../../../src/libCom/bucketLib -I../../../src/libCom/calc -I../../../src/libCom/cvtFast -I../../../src/libCom/cppStd -I../../../src/libCom/cxxTemplates -I../../../src/libCom/dbmf -I../../../src/libCom/ellLib -I../../../src/libCom/env -I../../../src/libCom/error -I../../../src/libCom/fdmgr -I../../../src/libCom/flex -I../../../src/libCom/freeList -I../../../src/libCom/gpHash -I../../../src/libCom/iocsh -I../../../src/libCom/log -I../../../src/libCom/macLib -I../../../src/libCom/misc -I../../../src/libCom/osi -I../../../src/libCom/pool -I../../../src/libCom/ring -I../../../src/libCom/taskwd -I../../../src/libCom/timer -I../../../src/libCom/yacc -I../../../src/libCom/yacc -I../../../src/libCom/yajl -I../../../include/compiler/gcc -I../../../include/os/RTEMS -I../../../include         -MM -MF epicsGeneralTime.d  ../../../src/libCom/osi/epicsGeneralTime.c
/usr/local/vw/rtems/rtems-4.10.2/bin/../libexec/gcc/m68k-rtems4.10.2/4.4.7/cc1: error while loading shared libraries: libmpfr.so.1: cannot open shared object file: No such file or directory
/usr/local/vw/rtems/rtems-4.10.2/bin/m68k-rtems4.10.2-g++ -B/usr/local/rtems/rtems-4.10.2/m68k-rtems4.10.2/uC5282/lib/ -specs bsp_specs -qrtems     -mcpu=5282         -DUSE_TYPED_RSET         -DUNIX      -O2 -g -g   -Wall       -DMY_DO_BOOTP=NULL     -I. -I../O.Common -I. -I../../../src/libCom/osi/compiler/gcc -I../../../src/libCom/osi/compiler/default -I. -I../../../src/libCom/osi/os/RTEMS -I../../../src/libCom/osi/os/posix -I../../../src/libCom/osi/os/default -I.. -I../../../src/libCom/as -I../../../src/libCom/bucketLib -I../../../src/libCom/calc -I../../../src/libCom/cvtFast -I../../../src/libCom/cppStd -I../../../src/libCom/cxxTemplates -I../../../src/libCom/dbmf -I../../../src/libCom/ellLib -I../../../src/libCom/env -I../../../src/libCom/error -I../../../src/libCom/fdmgr -I../../../src/libCom/flex -I../../../src/libCom/freeList -I../../../src/libCom/gpHash -I../../../src/libCom/iocsh -I../../../src/libCom/log -I../../../src/libCom/macLib -I../../../src/libCom/misc -I../../../src/libCom/osi -I../../../src/libCom/pool -I../../../src/libCom/ring -I../../../src/libCom/taskwd -I../../../src/libCom/timer -I../../../src/libCom/yacc -I../../../src/libCom/yacc -I../../../src/libCom/yajl -I../../../include/compiler/gcc -I../../../include/os/RTEMS -I../../../include         -MM -MF epicsAtomicOSD.d  ../../../src/libCom/osi/os/RTEMS/epicsAtomicOSD.cpp
/usr/local/vw/rtems/rtems-4.10.2/bin/../libexec/gcc/m68k-rtems4.10.2/4.4.7/cc1plus: error while loading shared libraries: libmpfr.so.1: cannot open shared object file: No such file or directory
/usr/local/vw/rtems/rtems-4.10.2/bin/m68k-rtems4.10.2-g++ -B/usr/local/rtems/rtems-4.10.2/m68k-rtems4.10.2/uC5282/lib/ -specs bsp_specs -qrtems     -mcpu=5282         -DUSE_TYPED_RSET         -DUNIX      -O2 -g -g   -Wall       -DMY_DO_BOOTP=NULL     -I. -I../O.Common -I. -I../../../src/libCom/osi/compiler/gcc -I../../../src/libCom/osi/compiler/default -I. -I../../../src/libCom/osi/os/RTEMS -I../../../src/libCom/osi/os/posix -I../../../src/libCom/osi/os/default -I.. -I../../../src/libCom/as -I../../../src/libCom/bucketLib -I../../../src/libCom/calc -I../../../src/libCom/cvtFast -I../../../src/libCom/cppStd -I../../../src/libCom/cxxTemplates -I../../../src/libCom/dbmf -I../../../src/libCom/ellLib -I../../../src/libCom/env -I../../../src/libCom/error -I../../../src/libCom/fdmgr -I../../../src/libCom/flex -I../../../src/libCom/freeList -I../../../src/libCom/gpHash -I../../../src/libCom/iocsh -I../../../src/libCom/log -I../../../src/libCom/macLib -I../../../src/libCom/misc -I../../../src/libCom/osi -I../../../src/libCom/pool -I../../../src/libCom/ring -I../../../src/libCom/taskwd -I../../../src/libCom/timer -I../../../src/libCom/yacc -I../../../src/libCom/yacc -I../../../src/libCom/yajl -I../../../include/compiler/gcc -I../../../include/os/RTEMS -I../../../include         -MM -MF epicsMath.d  ../../../src/libCom/osi/epicsMath.cpp
/usr/local/vw/rtems/rtems-4.10.2/bin/../libexec/gcc/m68k-rtems4.10.2/4.4.7/cc1plus: error while loading shared libraries: libmpfr.so.1: cannot open shared object file: No such file or directory
/usr/local/vw/rtems/rtems-4.10.2/bin/m68k-rtems4.10.2-g++ -B/usr/local/rtems/rtems-4.10.2/m68k-rtems4.10.2/uC5282/lib/ -specs bsp_specs -qrtems     -mcpu=5282         -DUSE_TYPED_RSET         -DUNIX      -O2 -g -g   -Wall       -DMY_DO_BOOTP=NULL     -I. -I../O.Common -I. -I../../../src/libCom/osi/compiler/gcc -I../../../src/libCom/osi/compiler/default -I. -I../../../src/libCom/osi/os/RTEMS -I../../../src/libCom/osi/os/posix -I../../../src/libCom/osi/os/default -I.. -I../../../src/libCom/as -I../../../src/libCom/bucketLib -I../../../src/libCom/calc -I../../../src/libCom/cvtFast -I../../../src/libCom/cppStd -I../../../src/libCom/cxxTemplates -I../../../src/libCom/dbmf -I../../../src/libCom/ellLib -I../../../src/libCom/env -I../../../src/libCom/error -I../../../src/libCom/fdmgr -I../../../src/libCom/flex -I../../../src/libCom/freeList -I../../../src/libCom/gpHash -I../../../src/libCom/iocsh -I../../../src/libCom/log -I../../../src/libCom/macLib -I../../../src/libCom/misc -I../../../src/libCom/osi -I../../../src/libCom/pool -I../../../src/libCom/ring -I../../../src/libCom/taskwd -I../../../src/libCom/timer -I../../../src/libCom/yacc -I../../../src/libCom/yacc -I../../../src/libCom/yajl -I../../../include/compiler/gcc -I../../../include/os/RTEMS -I../../../include         -MM -MF epicsMessageQueue.d  ../../../src/libCom/osi/epicsMessageQueue.cpp
/usr/local/vw/rtems/rtems-4.10.2/bin/../libexec/gcc/m68k-rtems4.10.2/4.4.7/cc1plus: error while loading shared libraries: libmpfr.so.1: cannot open shared object file: No such file or directory
/usr/local/vw/rtems/rtems-4.10.2/bin/m68k-rtems4.10.2-g++ -B/usr/local/rtems/rtems-4.10.2/m68k-rtems4.10.2/uC5282/lib/ -specs bsp_specs -qrtems     -mcpu=5282         -DUSE_TYPED_RSET         -DUNIX      -O2 -g -g   -Wall       -DMY_DO_BOOTP=NULL     -I. -I../O.Common -I. -I../../../src/libCom/osi/compiler/gcc -I../../../src/libCom/osi/compiler/default -I. -I../../../src/libCom/osi/os/RTEMS -I../../../src/libCom/osi/os/posix -I../../../src/libCom/osi/os/default -I.. -I../../../src/libCom/as -I../../../src/libCom/bucketLib -I../../../src/libCom/calc -I../../../src/libCom/cvtFast -I../../../src/libCom/cppStd -I../../../src/libCom/cxxTemplates -I../../../src/libCom/dbmf -I../../../src/libCom/ellLib -I../../../src/libCom/env -I../../../src/libCom/error -I../../../src/libCom/fdmgr -I../../../src/libCom/flex -I../../../src/libCom/freeList -I../../../src/libCom/gpHash -I../../../src/libCom/iocsh -I../../../src/libCom/log -I../../../src/libCom/macLib -I../../../src/libCom/misc -I../../../src/libCom/osi -I../../../src/libCom/pool -I../../../src/libCom/ring -I../../../src/libCom/taskwd -I../../../src/libCom/timer -I../../../src/libCom/yacc -I../../../src/libCom/yacc -I../../../src/libCom/yajl -I../../../include/compiler/gcc -I../../../include/os/RTEMS -I../../../include         -MM -MF epicsTime.d  ../../../src/libCom/osi/epicsTime.cpp
/usr/local/vw/rtems/rtems-4.10.2/bin/../libexec/gcc/m68k-rtems4.10.2/4.4.7/cc1plus: error while loading shared libraries: libmpfr.so.1: cannot open shared object file: No such file or directory
/usr/local/vw/rtems/rtems-4.10.2/bin/m68k-rtems4.10.2-g++ -B/usr/local/rtems/rtems-4.10.2/m68k-rtems4.10.2/uC5282/lib/ -specs bsp_specs -qrtems     -mcpu=5282         -DUSE_TYPED_RSET         -DUNIX      -O2 -g -g   -Wall       -DMY_DO_BOOTP=NULL     -I. -I../O.Common -I. -I../../../src/libCom/osi/compiler/gcc -I../../../src/libCom/osi/compiler/default -I. -I../../../src/libCom/osi/os/RTEMS -I../../../src/libCom/osi/os/posix -I../../../src/libCom/osi/os/default -I.. -I../../../src/libCom/as -I../../../src/libCom/bucketLib -I../../../src/libCom/calc -I../../../src/libCom/cvtFast -I../../../src/libCom/cppStd -I../../../src/libCom/cxxTemplates -I../../../src/libCom/dbmf -I../../../src/libCom/ellLib -I../../../src/libCom/env -I../../../src/libCom/error -I../../../src/libCom/fdmgr -I../../../src/libCom/flex -I../../../src/libCom/freeList -I../../../src/libCom/gpHash -I../../../src/libCom/iocsh -I../../../src/libCom/log -I../../../src/libCom/macLib -I../../../src/libCom/misc -I../../../src/libCom/osi -I../../../src/libCom/pool -I../../../src/libCom/ring -I../../../src/libCom/taskwd -I../../../src/libCom/timer -I../../../src/libCom/yacc -I../../../src/libCom/yacc -I../../../src/libCom/yajl -I../../../include/compiler/gcc -I../../../include/os/RTEMS -I../../../include         -MM -MF epicsEvent.d  ../../../src/libCom/osi/epicsEvent.cpp
/usr/local/vw/rtems/rtems-4.10.2/bin/../libexec/gcc/m68k-rtems4.10.2/4.4.7/cc1plus: error while loading shared libraries: libmpfr.so.1: cannot open shared object file: No such file or directory
/usr/local/vw/rtems/rtems-4.10.2/bin/m68k-rtems4.10.2-g++ -B/usr/local/rtems/rtems-4.10.2/m68k-rtems4.10.2/uC5282/lib/ -specs bsp_specs -qrtems     -mcpu=5282         -DUSE_TYPED_RSET         -DUNIX      -O2 -g -g   -Wall       -DMY_DO_BOOTP=NULL     -I. -I../O.Common -I. -I../../../src/libCom/osi/compiler/gcc -I../../../src/libCom/osi/compiler/default -I. -I../../../src/libCom/osi/os/RTEMS -I../../../src/libCom/osi/os/posix -I../../../src/libCom/osi/os/default -I.. -I../../../src/libCom/as -I../../../src/libCom/bucketLib -I../../../src/libCom/calc -I../../../src/libCom/cvtFast -I../../../src/libCom/cppStd -I../../../src/libCom/cxxTemplates -I../../../src/libCom/dbmf -I../../../src/libCom/ellLib -I../../../src/libCom/env -I../../../src/libCom/error -I../../../src/libCom/fdmgr -I../../../src/libCom/flex -I../../../src/libCom/freeList -I../../../src/libCom/gpHash -I../../../src/libCom/iocsh -I../../../src/libCom/log -I../../../src/libCom/macLib -I../../../src/libCom/misc -I../../../src/libCom/osi -I../../../src/libCom/pool -I../../../src/libCom/ring -I../../../src/libCom/taskwd -I../../../src/libCom/timer -I../../../src/libCom/yacc -I../../../src/libCom/yacc -I../../../src/libCom/yajl -I../../../include/compiler/gcc -I../../../include/os/RTEMS -I../../../include         -MM -MF epicsMutex.d  ../../../src/libCom/osi/epicsMutex.cpp
/usr/local/vw/rtems/rtems-4.10.2/bin/../libexec/gcc/m68k-rtems4.10.2/4.4.7/cc1plus: error while loading shared libraries: libmpfr.so.1: cannot open shared object file: No such file or directory
/usr/local/vw/rtems/rtems-4.10.2/bin/m68k-rtems4.10.2-g++ -B/usr/local/rtems/rtems-4.10.2/m68k-rtems4.10.2/uC5282/lib/ -specs bsp_specs -qrtems     -mcpu=5282         -DUSE_TYPED_RSET         -DUNIX      -O2 -g -g   -Wall       -DMY_DO_BOOTP=NULL     -I. -I../O.Common -I. -I../../../src/libCom/osi/compiler/gcc -I../../../src/libCom/osi/compiler/default -I. -I../../../src/libCom/osi/os/RTEMS -I../../../src/libCom/osi/os/posix -I../../../src/libCom/osi/os/default -I.. -I../../../src/libCom/as -I../../../src/libCom/bucketLib -I../../../src/libCom/calc -I../../../src/libCom/cvtFast -I../../../src/libCom/cppStd -I../../../src/libCom/cxxTemplates -I../../../src/libCom/dbmf -I../../../src/libCom/ellLib -I../../../src/libCom/env -I../../../src/libCom/error -I../../../src/libCom/fdmgr -I../../../src/libCom/flex -I../../../src/libCom/freeList -I../../../src/libCom/gpHash -I../../../src/libCom/iocsh -I../../../src/libCom/log -I../../../src/libCom/macLib -I../../../src/libCom/misc -I../../../src/libCom/osi -I../../../src/libCom/pool -I../../../src/libCom/ring -I../../../src/libCom/taskwd -I../../../src/libCom/timer -I../../../src/libCom/yacc -I../../../src/libCom/yacc -I../../../src/libCom/yajl -I../../../include/compiler/gcc -I../../../include/os/RTEMS -I../../../include         -MM -MF epicsThread.d  ../../../src/libCom/osi/epicsThread.cpp
/usr/local/vw/rtems/rtems-4.10.2/bin/../libexec/gcc/m68k-rtems4.10.2/4.4.7/cc1plus: error while loading shared libraries: libmpfr.so.1: cannot open shared object file: No such file or directory
/usr/local/vw/rtems/rtems-4.10.2/bin/m68k-rtems4.10.2-gcc --pipe -B/usr/local/rtems/rtems-4.10.2/m68k-rtems4.10.2/uC5282/lib/ -specs bsp_specs -qrtems   -fasm   -mcpu=5282         -DUSE_TYPED_RSET         -DUNIX      -O2 -g -g   -Wall       -DMY_DO_BOOTP=NULL     -I. -I../O.Common -I. -I../../../src/libCom/osi/compiler/gcc -I../../../src/libCom/osi/compiler/default -I. -I../../../src/libCom/osi/os/RTEMS -I../../../src/libCom/osi/os/posix -I../../../src/libCom/osi/os/default -I.. -I../../../src/libCom/as -I../../../src/libCom/bucketLib -I../../../src/libCom/calc -I../../../src/libCom/cvtFast -I../../../src/libCom/cppStd -I../../../src/libCom/cxxTemplates -I../../../src/libCom/dbmf -I../../../src/libCom/ellLib -I../../../src/libCom/env -I../../../src/libCom/error -I../../../src/libCom/fdmgr -I../../../src/libCom/flex -I../../../src/libCom/freeList -I../../../src/libCom/gpHash -I../../../src/libCom/iocsh -I../../../src/libCom/log -I../../../src/libCom/macLib -I../../../src/libCom/misc -I../../../src/libCom/osi -I../../../src/libCom/pool -I../../../src/libCom/ring -I../../../src/libCom/taskwd -I../../../src/libCom/timer -I../../../src/libCom/yacc -I../../../src/libCom/yacc -I../../../src/libCom/yajl -I../../../include/compiler/gcc -I../../../include/os/RTEMS -I../../../include         -MM -MF epicsUnitTest.d  ../../../src/libCom/misc/epicsUnitTest.c
/usr/local/vw/rtems/rtems-4.10.2/bin/../libexec/gcc/m68k-rtems4.10.2/4.4.7/cc1: error while loading shared libraries: libmpfr.so.1: cannot open shared object file: No such file or directory
/usr/local/vw/rtems/rtems-4.10.2/bin/m68k-rtems4.10.2-g++ -B/usr/local/rtems/rtems-4.10.2/m68k-rtems4.10.2/uC5282/lib/ -specs bsp_specs -qrtems     -mcpu=5282         -DUSE_TYPED_RSET         -DUNIX      -O2 -g -g   -Wall       -DMY_DO_BOOTP=NULL     -I. -I../O.Common -I. -I../../../src/libCom/osi/compiler/gcc -I../../../src/libCom/osi/compiler/default -I. -I../../../src/libCom/osi/os/RTEMS -I../../../src/libCom/osi/os/posix -I../../../src/libCom/osi/os/default -I.. -I../../../src/libCom/as -I../../../src/libCom/bucketLib -I../../../src/libCom/calc -I../../../src/libCom/cvtFast -I../../../src/libCom/cppStd -I../../../src/libCom/cxxTemplates -I../../../src/libCom/dbmf -I../../../src/libCom/ellLib -I../../../src/libCom/env -I../../../src/libCom/error -I../../../src/libCom/fdmgr -I../../../src/libCom/flex -I../../../src/libCom/freeList -I../../../src/libCom/gpHash -I../../../src/libCom/iocsh -I../../../src/libCom/log -I../../../src/libCom/macLib -I../../../src/libCom/misc -I../../../src/libCom/osi -I../../../src/libCom/pool -I../../../src/libCom/ring -I../../../src/libCom/taskwd -I../../../src/libCom/timer -I../../../src/libCom/yacc -I../../../src/libCom/yacc -I../../../src/libCom/yajl -I../../../include/compiler/gcc -I../../../include/os/RTEMS -I../../../include         -MM -MF ipAddrToAsciiAsynchronous.d  ../../../src/libCom/misc/ipAddrToAsciiAsynchronous.cpp
/usr/local/vw/rtems/rtems-4.10.2/bin/../libexec/gcc/m68k-rtems4.10.2/4.4.7/cc1plus: error while loading shared libraries: libmpfr.so.1: cannot open shared object file: No such file or directory
/usr/local/vw/rtems/rtems-4.10.2/bin/m68k-rtems4.10.2-gcc --pipe -B/usr/local/rtems/rtems-4.10.2/m68k-rtems4.10.2/uC5282/lib/ -specs bsp_specs -qrtems   -fasm   -mcpu=5282         -DUSE_TYPED_RSET         -DUNIX      -O2 -g -g   -Wall       -DMY_DO_BOOTP=NULL     -I. -I../O.Common -I. -I../../../src/libCom/osi/compiler/gcc -I../../../src/libCom/osi/compiler/default -I. -I../../../src/libCom/osi/os/RTEMS -I../../../src/libCom/osi/os/posix -I../../../src/libCom/osi/os/default -I.. -I../../../src/libCom/as -I../../../src/libCom/bucketLib -I../../../src/libCom/calc -I../../../src/libCom/cvtFast -I../../../src/libCom/cppStd -I../../../src/libCom/cxxTemplates -I../../../src/libCom/dbmf -I../../../src/libCom/ellLib -I../../../src/libCom/env -I../../../src/libCom/error -I../../../src/libCom/fdmgr -I../../../src/libCom/flex -I../../../src/libCom/freeList -I../../../src/libCom/gpHash -I../../../src/libCom/iocsh -I../../../src/libCom/log -I../../../src/libCom/macLib -I../../../src/libCom/misc -I../../../src/libCom/osi -I../../../src/libCom/pool -I../../../src/libCom/ring -I../../../src/libCom/taskwd -I../../../src/libCom/timer -I../../../src/libCom/yacc -I../../../src/libCom/yacc -I../../../src/libCom/yajl -I../../../include/compiler/gcc -I../../../include/os/RTEMS -I../../../include         -MM -MF truncateFile.d  ../../../src/libCom/misc/truncateFile.c
/usr/local/vw/rtems/rtems-4.10.2/bin/../libexec/gcc/m68k-rtems4.10.2/4.4.7/cc1: error while loading shared libraries: libmpfr.so.1: cannot open shared object file: No such file or directory
/usr/local/vw/rtems/rtems-4.10.2/bin/m68k-rtems4.10.2-gcc --pipe -B/usr/local/rtems/rtems-4.10.2/m68k-rtems4.10.2/uC5282/lib/ -specs bsp_specs -qrtems   -fasm   -mcpu=5282         -DUSE_TYPED_RSET         -DUNIX      -O2 -g -g   -Wall       -DMY_DO_BOOTP=NULL     -I. -I../O.Common -I. -I../../../src/libCom/osi/compiler/gcc -I../../../src/libCom/osi/compiler/default -I. -I../../../src/libCom/osi/os/RTEMS -I../../../src/libCom/osi/os/posix -I../../../src/libCom/osi/os/default -I.. -I../../../src/libCom/as -I../../../src/libCom/bucketLib -I../../../src/libCom/calc -I../../../src/libCom/cvtFast -I../../../src/libCom/cppStd -I../../../src/libCom/cxxTemplates -I../../../src/libCom/dbmf -I../../../src/libCom/ellLib -I../../../src/libCom/env -I../../../src/libCom/error -I../../../src/libCom/fdmgr -I../../../src/libCom/flex -I../../../src/libCom/freeList -I../../../src/libCom/gpHash -I../../../src/libCom/iocsh -I../../../src/libCom/log -I../../../src/libCom/macLib -I../../../src/libCom/misc -I../../../src/libCom/osi -I../../../src/libCom/pool -I../../../src/libCom/ring -I../../../src/libCom/taskwd -I../../../src/libCom/timer -I../../../src/libCom/yacc -I../../../src/libCom/yacc -I../../../src/libCom/yajl -I../../../include/compiler/gcc -I../../../include/os/RTEMS -I../../../include         -MM -MF epicsString.d  ../../../src/libCom/misc/epicsString.c
/usr/local/vw/rtems/rtems-4.10.2/bin/../libexec/gcc/m68k-rtems4.10.2/4.4.7/cc1: error while loading shared libraries: libmpfr.so.1: cannot open shared object file: No such file or directory
/usr/local/vw/rtems/rtems-4.10.2/bin/m68k-rtems4.10.2-gcc --pipe -B/usr/local/rtems/rtems-4.10.2/m68k-rtems4.10.2/uC5282/lib/ -specs bsp_specs -qrtems   -fasm   -mcpu=5282         -DUSE_TYPED_RSET         -DUNIX      -O2 -g -g   -Wall       -DMY_DO_BOOTP=NULL     -I. -I../O.Common -I. -I../../../src/libCom/osi/compiler/gcc -I../../../src/libCom/osi/compiler/default -I. -I../../../src/libCom/osi/os/RTEMS -I../../../src/libCom/osi/os/posix -I../../../src/libCom/osi/os/default -I.. -I../../../src/libCom/as -I../../../src/libCom/bucketLib -I../../../src/libCom/calc -I../../../src/libCom/cvtFast -I../../../src/libCom/cppStd -I../../../src/libCom/cxxTemplates -I../../../src/libCom/dbmf -I../../../src/libCom/ellLib -I../../../src/libCom/env -I../../../src/libCom/error -I../../../src/libCom/fdmgr -I../../../src/libCom/flex -I../../../src/libCom/freeList -I../../../src/libCom/gpHash -I../../../src/libCom/iocsh -I../../../src/libCom/log -I../../../src/libCom/macLib -I../../../src/libCom/misc -I../../../src/libCom/osi -I../../../src/libCom/pool -I../../../src/libCom/ring -I../../../src/libCom/taskwd -I../../../src/libCom/timer -I../../../src/libCom/yacc -I../../../src/libCom/yacc -I../../../src/libCom/yajl -I../../../include/compiler/gcc -I../../../include/os/RTEMS -I../../../include         -MM -MF epicsStdlib.d  ../../../src/libCom/misc/epicsStdlib.c
/usr/local/vw/rtems/rtems-4.10.2/bin/../libexec/gcc/m68k-rtems4.10.2/4.4.7/cc1: error while loading shared libraries: libmpfr.so.1: cannot open shared object file: No such file or directory
/usr/local/vw/rtems/rtems-4.10.2/bin/m68k-rtems4.10.2-gcc --pipe -B/usr/local/rtems/rtems-4.10.2/m68k-rtems4.10.2/uC5282/lib/ -specs bsp_specs -qrtems   -fasm   -mcpu=5282         -DUSE_TYPED_RSET         -DUNIX      -O2 -g -g   -Wall       -DMY_DO_BOOTP=NULL     -I. -I../O.Common -I. -I../../../src/libCom/osi/compiler/gcc -I../../../src/libCom/osi/compiler/default -I. -I../../../src/libCom/osi/os/RTEMS -I../../../src/libCom/osi/os/posix -I../../../src/libCom/osi/os/default -I.. -I../../../src/libCom/as -I../../../src/libCom/bucketLib -I../../../src/libCom/calc -I../../../src/libCom/cvtFast -I../../../src/libCom/cppStd -I../../../src/libCom/cxxTemplates -I../../../src/libCom/dbmf -I../../../src/libCom/ellLib -I../../../src/libCom/env -I../../../src/libCom/error -I../../../src/libCom/fdmgr -I../../../src/libCom/flex -I../../../src/libCom/freeList -I../../../src/libCom/gpHash -I../../../src/libCom/iocsh -I../../../src/libCom/log -I../../../src/libCom/macLib -I../../../src/libCom/misc -I../../../src/libCom/osi -I../../../src/libCom/pool -I../../../src/libCom/ring -I../../../src/libCom/taskwd -I../../../src/libCom/timer -I../../../src/libCom/yacc -I../../../src/libCom/yacc -I../../../src/libCom/yajl -I../../../include/compiler/gcc -I../../../include/os/RTEMS -I../../../include         -MM -MF epicsExit.d  ../../../src/libCom/misc/epicsExit.c
/usr/local/vw/rtems/rtems-4.10.2/bin/../libexec/gcc/m68k-rtems4.10.2/4.4.7/cc1: error while loading shared libraries: libmpfr.so.1: cannot open shared object file: No such file or directory
/usr/local/vw/rtems/rtems-4.10.2/bin/m68k-rtems4.10.2-gcc --pipe -B/usr/local/rtems/rtems-4.10.2/m68k-rtems4.10.2/uC5282/lib/ -specs bsp_specs -qrtems   -fasm   -mcpu=5282         -DUSE_TYPED_RSET         -DUNIX      -O2 -g -g   -Wall       -DMY_DO_BOOTP=NULL     -I. -I../O.Common -I. -I../../../src/libCom/osi/compiler/gcc -I../../../src/libCom/osi/compiler/default -I. -I../../../src/libCom/osi/os/RTEMS -I../../../src/libCom/osi/os/posix -I../../../src/libCom/osi/os/default -I.. -I../../../src/libCom/as -I../../../src/libCom/bucketLib -I../../../src/libCom/calc -I../../../src/libCom/cvtFast -I../../../src/libCom/cppStd -I../../../src/libCom/cxxTemplates -I../../../src/libCom/dbmf -I../../../src/libCom/ellLib -I../../../src/libCom/env -I../../../src/libCom/error -I../../../src/libCom/fdmgr -I../../../src/libCom/flex -I../../../src/libCom/freeList -I../../../src/libCom/gpHash -I../../../src/libCom/iocsh -I../../../src/libCom/log -I../../../src/libCom/macLib -I../../../src/libCom/misc -I../../../src/libCom/osi -I../../../src/libCom/pool -I../../../src/libCom/ring -I../../../src/libCom/taskwd -I../../../src/libCom/timer -I../../../src/libCom/yacc -I../../../src/libCom/yacc -I../../../src/libCom/yajl -I../../../include/compiler/gcc -I../../../include/os/RTEMS -I../../../include         -MM -MF epicsConvert.d  ../../../src/libCom/misc/epicsConvert.c
/usr/local/vw/rtems/rtems-4.10.2/bin/../libexec/gcc/m68k-rtems4.10.2/4.4.7/cc1: error while loading shared libraries: libmpfr.so.1: cannot open shared object file: No such file or directory
/usr/local/vw/rtems/rtems-4.10.2/bin/m68k-rtems4.10.2-gcc --pipe -B/usr/local/rtems/rtems-4.10.2/m68k-rtems4.10.2/uC5282/lib/ -specs bsp_specs -qrtems   -fasm   -mcpu=5282         -DUSE_TYPED_RSET         -DUNIX      -O2 -g -g   -Wall       -DMY_DO_BOOTP=NULL     -I. -I../O.Common -I. -I../../../src/libCom/osi/compiler/gcc -I../../../src/libCom/osi/compiler/default -I. -I../../../src/libCom/osi/os/RTEMS -I../../../src/libCom/osi/os/posix -I../../../src/libCom/osi/os/default -I.. -I../../../src/libCom/as -I../../../src/libCom/bucketLib -I../../../src/libCom/calc -I../../../src/libCom/cvtFast -I../../../src/libCom/cppStd -I../../../src/libCom/cxxTemplates -I../../../src/libCom/dbmf -I../../../src/libCom/ellLib -I../../../src/libCom/env -I../../../src/libCom/error -I../../../src/libCom/fdmgr -I../../../src/libCom/flex -I../../../src/libCom/freeList -I../../../src/libCom/gpHash -I../../../src/libCom/iocsh -I../../../src/libCom/log -I../../../src/libCom/macLib -I../../../src/libCom/misc -I../../../src/libCom/osi -I../../../src/libCom/pool -I../../../src/libCom/ring -I../../../src/libCom/taskwd -I../../../src/libCom/timer -I../../../src/libCom/yacc -I../../../src/libCom/yacc -I../../../src/libCom/yajl -I../../../include/compiler/gcc -I../../../include/os/RTEMS -I../../../include         -MM -MF cantProceed.d  ../../../src/libCom/misc/cantProceed.c
/usr/local/vw/rtems/rtems-4.10.2/bin/../libexec/gcc/m68k-rtems4.10.2/4.4.7/cc1: error while loading shared libraries: libmpfr.so.1: cannot open shared object file: No such file or directory
/usr/local/vw/rtems/rtems-4.10.2/bin/m68k-rtems4.10.2-gcc --pipe -B/usr/local/rtems/rtems-4.10.2/m68k-rtems4.10.2/uC5282/lib/ -specs bsp_specs -qrtems   -fasm   -mcpu=5282         -DUSE_TYPED_RSET         -DUNIX      -O2 -g -g   -Wall       -DMY_DO_BOOTP=NULL     -I. -I../O.Common -I. -I../../../src/libCom/osi/compiler/gcc -I../../../src/libCom/osi/compiler/default -I. -I../../../src/libCom/osi/os/RTEMS -I../../../src/libCom/osi/os/posix -I../../../src/libCom/osi/os/default -I.. -I../../../src/libCom/as -I../../../src/libCom/bucketLib -I../../../src/libCom/calc -I../../../src/libCom/cvtFast -I../../../src/libCom/cppStd -I../../../src/libCom/cxxTemplates -I../../../src/libCom/dbmf -I../../../src/libCom/ellLib -I../../../src/libCom/env -I../../../src/libCom/error -I../../../src/libCom/fdmgr -I../../../src/libCom/flex -I../../../src/libCom/freeList -I../../../src/libCom/gpHash -I../../../src/libCom/iocsh -I../../../src/libCom/log -I../../../src/libCom/macLib -I../../../src/libCom/misc -I../../../src/libCom/osi -I../../../src/libCom/pool -I../../../src/libCom/ring -I../../../src/libCom/taskwd -I../../../src/libCom/timer -I../../../src/libCom/yacc -I../../../src/libCom/yacc -I../../../src/libCom/yajl -I../../../include/compiler/gcc -I../../../include/os/RTEMS -I../../../include         -MM -MF adjustment.d  ../../../src/libCom/misc/adjustment.c
/usr/local/vw/rtems/rtems-4.10.2/bin/../libexec/gcc/m68k-rtems4.10.2/4.4.7/cc1: error while loading shared libraries: libmpfr.so.1: cannot open shared object file: No such file or directory
/usr/local/vw/rtems/rtems-4.10.2/bin/m68k-rtems4.10.2-gcc --pipe -B/usr/local/rtems/rtems-4.10.2/m68k-rtems4.10.2/uC5282/lib/ -specs bsp_specs -qrtems   -fasm   -mcpu=5282         -DUSE_TYPED_RSET         -DUNIX      -O2 -g -g   -Wall       -DMY_DO_BOOTP=NULL     -I. -I../O.Common -I. -I../../../src/libCom/osi/compiler/gcc -I../../../src/libCom/osi/compiler/default -I. -I../../../src/libCom/osi/os/RTEMS -I../../../src/libCom/osi/os/posix -I../../../src/libCom/osi/os/default -I.. -I../../../src/libCom/as -I../../../src/libCom/bucketLib -I../../../src/libCom/calc -I../../../src/libCom/cvtFast -I../../../src/libCom/cppStd -I../../../src/libCom/cxxTemplates -I../../../src/libCom/dbmf -I../../../src/libCom/ellLib -I../../../src/libCom/env -I../../../src/libCom/error -I../../../src/libCom/fdmgr -I../../../src/libCom/flex -I../../../src/libCom/freeList -I../../../src/libCom/gpHash -I../../../src/libCom/iocsh -I../../../src/libCom/log -I../../../src/libCom/macLib -I../../../src/libCom/misc -I../../../src/libCom/osi -I../../../src/libCom/pool -I../../../src/libCom/ring -I../../../src/libCom/taskwd -I../../../src/libCom/timer -I../../../src/libCom/yacc -I../../../src/libCom/yacc -I../../../src/libCom/yajl -I../../../include/compiler/gcc -I../../../include/os/RTEMS -I../../../include         -MM -MF aToIPAddr.d  ../../../src/libCom/misc/aToIPAddr.c
/usr/local/vw/rtems/rtems-4.10.2/bin/../libexec/gcc/m68k-rtems4.10.2/4.4.7/cc1: error while loading shared libraries: libmpfr.so.1: cannot open shared object file: No such file or directory
/usr/local/vw/rtems/rtems-4.10.2/bin/m68k-rtems4.10.2-gcc --pipe -B/usr/local/rtems/rtems-4.10.2/m68k-rtems4.10.2/uC5282/lib/ -specs bsp_specs -qrtems   -fasm   -mcpu=5282         -DUSE_TYPED_RSET         -DUNIX      -O2 -g -g   -Wall       -DMY_DO_BOOTP=NULL     -I. -I../O.Common -I. -I../../../src/libCom/osi/compiler/gcc -I../../../src/libCom/osi/compiler/default -I. -I../../../src/libCom/osi/os/RTEMS -I../../../src/libCom/osi/os/posix -I../../../src/libCom/osi/os/default -I.. -I../../../src/libCom/as -I../../../src/libCom/bucketLib -I../../../src/libCom/calc -I../../../src/libCom/cvtFast -I../../../src/libCom/cppStd -I../../../src/libCom/cxxTemplates -I../../../src/libCom/dbmf -I../../../src/libCom/ellLib -I../../../src/libCom/env -I../../../src/libCom/error -I../../../src/libCom/fdmgr -I../../../src/libCom/flex -I../../../src/libCom/freeList -I../../../src/libCom/gpHash -I../../../src/libCom/iocsh -I../../../src/libCom/log -I../../../src/libCom/macLib -I../../../src/libCom/misc -I../../../src/libCom/osi -I../../../src/libCom/pool -I../../../src/libCom/ring -I../../../src/libCom/taskwd -I../../../src/libCom/timer -I../../../src/libCom/yacc -I../../../src/libCom/yacc -I../../../src/libCom/yajl -I../../../include/compiler/gcc -I../../../include/os/RTEMS -I../../../include         -MM -MF alarmString.d  ../../../src/libCom/misc/alarmString.c
/usr/local/vw/rtems/rtems-4.10.2/bin/../libexec/gcc/m68k-rtems4.10.2/4.4.7/cc1: error while loading shared libraries: libmpfr.so.1: cannot open shared object file: No such file or directory
/usr/local/vw/rtems/rtems-4.10.2/bin/m68k-rtems4.10.2-gcc --pipe -B/usr/local/rtems/rtems-4.10.2/m68k-rtems4.10.2/uC5282/lib/ -specs bsp_specs -qrtems   -fasm   -mcpu=5282         -DUSE_TYPED_RSET         -DUNIX      -O2 -g -g   -Wall       -DMY_DO_BOOTP=NULL     -I. -I../O.Common -I. -I../../../src/libCom/osi/compiler/gcc -I../../../src/libCom/osi/compiler/default -I. -I../../../src/libCom/osi/os/RTEMS -I../../../src/libCom/osi/os/posix -I../../../src/libCom/osi/os/default -I.. -I../../../src/libCom/as -I../../../src/libCom/bucketLib -I../../../src/libCom/calc -I../../../src/libCom/cvtFast -I../../../src/libCom/cppStd -I../../../src/libCom/cxxTemplates -I../../../src/libCom/dbmf -I../../../src/libCom/ellLib -I../../../src/libCom/env -I../../../src/libCom/error -I../../../src/libCom/fdmgr -I../../../src/libCom/flex -I../../../src/libCom/freeList -I../../../src/libCom/gpHash -I../../../src/libCom/iocsh -I../../../src/libCom/log -I../../../src/libCom/macLib -I../../../src/libCom/misc -I../../../src/libCom/osi -I../../../src/libCom/pool -I../../../src/libCom/ring -I../../../src/libCom/taskwd -I../../../src/libCom/timer -I../../../src/libCom/yacc -I../../../src/libCom/yacc -I../../../src/libCom/yajl -I../../../include/compiler/gcc -I../../../include/os/RTEMS -I../../../include         -MM -MF macUtil.d  ../../../src/libCom/macLib/macUtil.c
/usr/local/vw/rtems/rtems-4.10.2/bin/../libexec/gcc/m68k-rtems4.10.2/4.4.7/cc1: error while loading shared libraries: libmpfr.so.1: cannot open shared object file: No such file or directory
/usr/local/vw/rtems/rtems-4.10.2/bin/m68k-rtems4.10.2-gcc --pipe -B/usr/local/rtems/rtems-4.10.2/m68k-rtems4.10.2/uC5282/lib/ -specs bsp_specs -qrtems   -fasm   -mcpu=5282         -DUSE_TYPED_RSET         -DUNIX      -O2 -g -g   -Wall       -DMY_DO_BOOTP=NULL     -I. -I../O.Common -I. -I../../../src/libCom/osi/compiler/gcc -I../../../src/libCom/osi/compiler/default -I. -I../../../src/libCom/osi/os/RTEMS -I../../../src/libCom/osi/os/posix -I../../../src/libCom/osi/os/default -I.. -I../../../src/libCom/as -I../../../src/libCom/bucketLib -I../../../src/libCom/calc -I../../../src/libCom/cvtFast -I../../../src/libCom/cppStd -I../../../src/libCom/cxxTemplates -I../../../src/libCom/dbmf -I../../../src/libCom/ellLib -I../../../src/libCom/env -I../../../src/libCom/error -I../../../src/libCom/fdmgr -I../../../src/libCom/flex -I../../../src/libCom/freeList -I../../../src/libCom/gpHash -I../../../src/libCom/iocsh -I../../../src/libCom/log -I../../../src/libCom/macLib -I../../../src/libCom/misc -I../../../src/libCom/osi -I../../../src/libCom/pool -I../../../src/libCom/ring -I../../../src/libCom/taskwd -I../../../src/libCom/timer -I../../../src/libCom/yacc -I../../../src/libCom/yacc -I../../../src/libCom/yajl -I../../../include/compiler/gcc -I../../../include/os/RTEMS -I../../../include         -MM -MF macEnv.d  ../../../src/libCom/macLib/macEnv.c
/usr/local/vw/rtems/rtems-4.10.2/bin/../libexec/gcc/m68k-rtems4.10.2/4.4.7/cc1: error while loading shared libraries: libmpfr.so.1: cannot open shared object file: No such file or directory
/usr/local/vw/rtems/rtems-4.10.2/bin/m68k-rtems4.10.2-gcc --pipe -B/usr/local/rtems/rtems-4.10.2/m68k-rtems4.10.2/uC5282/lib/ -specs bsp_specs -qrtems   -fasm   -mcpu=5282         -DUSE_TYPED_RSET         -DUNIX      -O2 -g -g   -Wall       -DMY_DO_BOOTP=NULL     -I. -I../O.Common -I. -I../../../src/libCom/osi/compiler/gcc -I../../../src/libCom/osi/compiler/default -I. -I../../../src/libCom/osi/os/RTEMS -I../../../src/libCom/osi/os/posix -I../../../src/libCom/osi/os/default -I.. -I../../../src/libCom/as -I../../../src/libCom/bucketLib -I../../../src/libCom/calc -I../../../src/libCom/cvtFast -I../../../src/libCom/cppStd -I../../../src/libCom/cxxTemplates -I../../../src/libCom/dbmf -I../../../src/libCom/ellLib -I../../../src/libCom/env -I../../../src/libCom/error -I../../../src/libCom/fdmgr -I../../../src/libCom/flex -I../../../src/libCom/freeList -I../../../src/libCom/gpHash -I../../../src/libCom/iocsh -I../../../src/libCom/log -I../../../src/libCom/macLib -I../../../src/libCom/misc -I../../../src/libCom/osi -I../../../src/libCom/pool -I../../../src/libCom/ring -I../../../src/libCom/taskwd -I../../../src/libCom/timer -I../../../src/libCom/yacc -I../../../src/libCom/yacc -I../../../src/libCom/yajl -I../../../include/compiler/gcc -I../../../include/os/RTEMS -I../../../include         -MM -MF macCore.d  ../../../src/libCom/macLib/macCore.c
/usr/local/vw/rtems/rtems-4.10.2/bin/../libexec/gcc/m68k-rtems4.10.2/4.4.7/cc1: error while loading shared libraries: libmpfr.so.1: cannot open shared object file: No such file or directory
/usr/local/vw/rtems/rtems-4.10.2/bin/m68k-rtems4.10.2-gcc --pipe -B/usr/local/rtems/rtems-4.10.2/m68k-rtems4.10.2/uC5282/lib/ -specs bsp_specs -qrtems   -fasm   -mcpu=5282         -DUSE_TYPED_RSET         -DUNIX      -O2 -g -g   -Wall       -DMY_DO_BOOTP=NULL     -I. -I../O.Common -I. -I../../../src/libCom/osi/compiler/gcc -I../../../src/libCom/osi/compiler/default -I. -I../../../src/libCom/osi/os/RTEMS -I../../../src/libCom/osi/os/posix -I../../../src/libCom/osi/os/default -I.. -I../../../src/libCom/as -I../../../src/libCom/bucketLib -I../../../src/libCom/calc -I../../../src/libCom/cvtFast -I../../../src/libCom/cppStd -I../../../src/libCom/cxxTemplates -I../../../src/libCom/dbmf -I../../../src/libCom/ellLib -I../../../src/libCom/env -I../../../src/libCom/error -I../../../src/libCom/fdmgr -I../../../src/libCom/flex -I../../../src/libCom/freeList -I../../../src/libCom/gpHash -I../../../src/libCom/iocsh -I../../../src/libCom/log -I../../../src/libCom/macLib -I../../../src/libCom/misc -I../../../src/libCom/osi -I../../../src/libCom/pool -I../../../src/libCom/ring -I../../../src/libCom/taskwd -I../../../src/libCom/timer -I../../../src/libCom/yacc -I../../../src/libCom/yacc -I../../../src/libCom/yajl -I../../../include/compiler/gcc -I../../../include/os/RTEMS -I../../../include         -MM -MF logClient.d  ../../../src/libCom/log/logClient.c
/usr/local/vw/rtems/rtems-4.10.2/bin/../libexec/gcc/m68k-rtems4.10.2/4.4.7/cc1: error while loading shared libraries: libmpfr.so.1: cannot open shared object file: No such file or directory
/usr/local/vw/rtems/rtems-4.10.2/bin/m68k-rtems4.10.2-gcc --pipe -B/usr/local/rtems/rtems-4.10.2/m68k-rtems4.10.2/uC5282/lib/ -specs bsp_specs -qrtems   -fasm   -mcpu=5282         -DUSE_TYPED_RSET         -DUNIX      -O2 -g -g   -Wall       -DMY_DO_BOOTP=NULL     -I. -I../O.Common -I. -I../../../src/libCom/osi/compiler/gcc -I../../../src/libCom/osi/compiler/default -I. -I../../../src/libCom/osi/os/RTEMS -I../../../src/libCom/osi/os/posix -I../../../src/libCom/osi/os/default -I.. -I../../../src/libCom/as -I../../../src/libCom/bucketLib -I../../../src/libCom/calc -I../../../src/libCom/cvtFast -I../../../src/libCom/cppStd -I../../../src/libCom/cxxTemplates -I../../../src/libCom/dbmf -I../../../src/libCom/ellLib -I../../../src/libCom/env -I../../../src/libCom/error -I../../../src/libCom/fdmgr -I../../../src/libCom/flex -I../../../src/libCom/freeList -I../../../src/libCom/gpHash -I../../../src/libCom/iocsh -I../../../src/libCom/log -I../../../src/libCom/macLib -I../../../src/libCom/misc -I../../../src/libCom/osi -I../../../src/libCom/pool -I../../../src/libCom/ring -I../../../src/libCom/taskwd -I../../../src/libCom/timer -I../../../src/libCom/yacc -I../../../src/libCom/yacc -I../../../src/libCom/yajl -I../../../include/compiler/gcc -I../../../include/os/RTEMS -I../../../include         -MM -MF iocLog.d  ../../../src/libCom/log/iocLog.c
/usr/local/vw/rtems/rtems-4.10.2/bin/../libexec/gcc/m68k-rtems4.10.2/4.4.7/cc1: error while loading shared libraries: libmpfr.so.1: cannot open shared object file: No such file or directory
/usr/local/vw/rtems/rtems-4.10.2/bin/m68k-rtems4.10.2-gcc --pipe -B/usr/local/rtems/rtems-4.10.2/m68k-rtems4.10.2/uC5282/lib/ -specs bsp_specs -qrtems   -fasm   -mcpu=5282         -DUSE_TYPED_RSET         -DUNIX      -O2 -g -g   -Wall       -DMY_DO_BOOTP=NULL     -I. -I../O.Common -I. -I../../../src/libCom/osi/compiler/gcc -I../../../src/libCom/osi/compiler/default -I. -I../../../src/libCom/osi/os/RTEMS -I../../../src/libCom/osi/os/posix -I../../../src/libCom/osi/os/default -I.. -I../../../src/libCom/as -I../../../src/libCom/bucketLib -I../../../src/libCom/calc -I../../../src/libCom/cvtFast -I../../../src/libCom/cppStd -I../../../src/libCom/cxxTemplates -I../../../src/libCom/dbmf -I../../../src/libCom/ellLib -I../../../src/libCom/env -I../../../src/libCom/error -I../../../src/libCom/fdmgr -I../../../src/libCom/flex -I../../../src/libCom/freeList -I../../../src/libCom/gpHash -I../../../src/libCom/iocsh -I../../../src/libCom/log -I../../../src/libCom/macLib -I../../../src/libCom/misc -I../../../src/libCom/osi -I../../../src/libCom/pool -I../../../src/libCom/ring -I../../../src/libCom/taskwd -I../../../src/libCom/timer -I../../../src/libCom/yacc -I../../../src/libCom/yacc -I../../../src/libCom/yajl -I../../../include/compiler/gcc -I../../../include/os/RTEMS -I../../../include         -MM -MF libComRegister.d  ../../../src/libCom/iocsh/libComRegister.c
/usr/local/vw/rtems/rtems-4.10.2/bin/../libexec/gcc/m68k-rtems4.10.2/4.4.7/cc1: error while loading shared libraries: libmpfr.so.1: cannot open shared object file: No such file or directory
/usr/local/vw/rtems/rtems-4.10.2/bin/m68k-rtems4.10.2-gcc --pipe -B/usr/local/rtems/rtems-4.10.2/m68k-rtems4.10.2/uC5282/lib/ -specs bsp_specs -qrtems   -fasm   -mcpu=5282         -DUSE_TYPED_RSET         -DUNIX      -O2 -g -g   -Wall       -DMY_DO_BOOTP=NULL     -I. -I../O.Common -I. -I../../../src/libCom/osi/compiler/gcc -I../../../src/libCom/osi/compiler/default -I. -I../../../src/libCom/osi/os/RTEMS -I../../../src/libCom/osi/os/posix -I../../../src/libCom/osi/os/default -I.. -I../../../src/libCom/as -I../../../src/libCom/bucketLib -I../../../src/libCom/calc -I../../../src/libCom/cvtFast -I../../../src/libCom/cppStd -I../../../src/libCom/cxxTemplates -I../../../src/libCom/dbmf -I../../../src/libCom/ellLib -I../../../src/libCom/env -I../../../src/libCom/error -I../../../src/libCom/fdmgr -I../../../src/libCom/flex -I../../../src/libCom/freeList -I../../../src/libCom/gpHash -I../../../src/libCom/iocsh -I../../../src/libCom/log -I../../../src/libCom/macLib -I../../../src/libCom/misc -I../../../src/libCom/osi -I../../../src/libCom/pool -I../../../src/libCom/ring -I../../../src/libCom/taskwd -I../../../src/libCom/timer -I../../../src/libCom/yacc -I../../../src/libCom/yacc -I../../../src/libCom/yajl -I../../../include/compiler/gcc -I../../../include/os/RTEMS -I../../../include         -MM -MF registry.d  ../../../src/libCom/iocsh/registry.c
/usr/local/vw/rtems/rtems-4.10.2/bin/../libexec/gcc/m68k-rtems4.10.2/4.4.7/cc1: error while loading shared libraries: libmpfr.so.1: cannot open shared object file: No such file or directory
/usr/local/vw/rtems/rtems-4.10.2/bin/m68k-rtems4.10.2-g++ -B/usr/local/rtems/rtems-4.10.2/m68k-rtems4.10.2/uC5282/lib/ -specs bsp_specs -qrtems     -mcpu=5282         -DUSE_TYPED_RSET         -DUNIX      -O2 -g -g   -Wall       -DMY_DO_BOOTP=NULL     -I. -I../O.Common -I. -I../../../src/libCom/osi/compiler/gcc -I../../../src/libCom/osi/compiler/default -I. -I../../../src/libCom/osi/os/RTEMS -I../../../src/libCom/osi/os/posix -I../../../src/libCom/osi/os/default -I.. -I../../../src/libCom/as -I../../../src/libCom/bucketLib -I../../../src/libCom/calc -I../../../src/libCom/cvtFast -I../../../src/libCom/cppStd -I../../../src/libCom/cxxTemplates -I../../../src/libCom/dbmf -I../../../src/libCom/ellLib -I../../../src/libCom/env -I../../../src/libCom/error -I../../../src/libCom/fdmgr -I../../../src/libCom/flex -I../../../src/libCom/freeList -I../../../src/libCom/gpHash -I../../../src/libCom/iocsh -I../../../src/libCom/log -I../../../src/libCom/macLib -I../../../src/libCom/misc -I../../../src/libCom/osi -I../../../src/libCom/pool -I../../../src/libCom/ring -I../../../src/libCom/taskwd -I../../../src/libCom/timer -I../../../src/libCom/yacc -I../../../src/libCom/yacc -I../../../src/libCom/yajl -I../../../include/compiler/gcc -I../../../include/os/RTEMS -I../../../include         -MM -MF iocsh.d  ../../../src/libCom/iocsh/iocsh.cpp
/usr/local/vw/rtems/rtems-4.10.2/bin/../libexec/gcc/m68k-rtems4.10.2/4.4.7/cc1plus: error while loading shared libraries: libmpfr.so.1: cannot open shared object file: No such file or directory
/usr/local/vw/rtems/rtems-4.10.2/bin/m68k-rtems4.10.2-gcc --pipe -B/usr/local/rtems/rtems-4.10.2/m68k-rtems4.10.2/uC5282/lib/ -specs bsp_specs -qrtems   -fasm   -mcpu=5282         -DUSE_TYPED_RSET         -DUNIX      -O2 -g -g   -Wall       -DMY_DO_BOOTP=NULL     -I. -I../O.Common -I. -I../../../src/libCom/osi/compiler/gcc -I../../../src/libCom/osi/compiler/default -I. -I../../../src/libCom/osi/os/RTEMS -I../../../src/libCom/osi/os/posix -I../../../src/libCom/osi/os/default -I.. -I../../../src/libCom/as -I../../../src/libCom/bucketLib -I../../../src/libCom/calc -I../../../src/libCom/cvtFast -I../../../src/libCom/cppStd -I../../../src/libCom/cxxTemplates -I../../../src/libCom/dbmf -I../../../src/libCom/ellLib -I../../../src/libCom/env -I../../../src/libCom/error -I../../../src/libCom/fdmgr -I../../../src/libCom/flex -I../../../src/libCom/freeList -I../../../src/libCom/gpHash -I../../../src/libCom/iocsh -I../../../src/libCom/log -I../../../src/libCom/macLib -I../../../src/libCom/misc -I../../../src/libCom/osi -I../../../src/libCom/pool -I../../../src/libCom/ring -I../../../src/libCom/taskwd -I../../../src/libCom/timer -I../../../src/libCom/yacc -I../../../src/libCom/yacc -I../../../src/libCom/yajl -I../../../include/compiler/gcc -I../../../include/os/RTEMS -I../../../include         -MM -MF gpHashLib.d  ../../../src/libCom/gpHash/gpHashLib.c
/usr/local/vw/rtems/rtems-4.10.2/bin/../libexec/gcc/m68k-rtems4.10.2/4.4.7/cc1: error while loading shared libraries: libmpfr.so.1: cannot open shared object file: No such file or directory
/usr/local/vw/rtems/rtems-4.10.2/bin/m68k-rtems4.10.2-gcc --pipe -B/usr/local/rtems/rtems-4.10.2/m68k-rtems4.10.2/uC5282/lib/ -specs bsp_specs -qrtems   -fasm   -mcpu=5282         -DUSE_TYPED_RSET         -DUNIX      -O2 -g -g   -Wall       -DMY_DO_BOOTP=NULL     -I. -I../O.Common -I. -I../../../src/libCom/osi/compiler/gcc -I../../../src/libCom/osi/compiler/default -I. -I../../../src/libCom/osi/os/RTEMS -I../../../src/libCom/osi/os/posix -I../../../src/libCom/osi/os/default -I.. -I../../../src/libCom/as -I../../../src/libCom/bucketLib -I../../../src/libCom/calc -I../../../src/libCom/cvtFast -I../../../src/libCom/cppStd -I../../../src/libCom/cxxTemplates -I../../../src/libCom/dbmf -I../../../src/libCom/ellLib -I../../../src/libCom/env -I../../../src/libCom/error -I../../../src/libCom/fdmgr -I../../../src/libCom/flex -I../../../src/libCom/freeList -I../../../src/libCom/gpHash -I../../../src/libCom/iocsh -I../../../src/libCom/log -I../../../src/libCom/macLib -I../../../src/libCom/misc -I../../../src/libCom/osi -I../../../src/libCom/pool -I../../../src/libCom/ring -I../../../src/libCom/taskwd -I../../../src/libCom/timer -I../../../src/libCom/yacc -I../../../src/libCom/yacc -I../../../src/libCom/yajl -I../../../include/compiler/gcc -I../../../include/os/RTEMS -I../../../include         -MM -MF freeListLib.d  ../../../src/libCom/freeList/freeListLib.c
/usr/local/vw/rtems/rtems-4.10.2/bin/../libexec/gcc/m68k-rtems4.10.2/4.4.7/cc1: error while loading shared libraries: libmpfr.so.1: cannot open shared object file: No such file or directory
/usr/local/vw/rtems/rtems-4.10.2/bin/m68k-rtems4.10.2-g++ -B/usr/local/rtems/rtems-4.10.2/m68k-rtems4.10.2/uC5282/lib/ -specs bsp_specs -qrtems     -mcpu=5282         -DUSE_TYPED_RSET         -DUNIX      -O2 -g -g   -Wall       -DMY_DO_BOOTP=NULL     -I. -I../O.Common -I. -I../../../src/libCom/osi/compiler/gcc -I../../../src/libCom/osi/compiler/default -I. -I../../../src/libCom/osi/os/RTEMS -I../../../src/libCom/osi/os/posix -I../../../src/libCom/osi/os/default -I.. -I../../../src/libCom/as -I../../../src/libCom/bucketLib -I../../../src/libCom/calc -I../../../src/libCom/cvtFast -I../../../src/libCom/cppStd -I../../../src/libCom/cxxTemplates -I../../../src/libCom/dbmf -I../../../src/libCom/ellLib -I../../../src/libCom/env -I../../../src/libCom/error -I../../../src/libCom/fdmgr -I../../../src/libCom/flex -I../../../src/libCom/freeList -I../../../src/libCom/gpHash -I../../../src/libCom/iocsh -I../../../src/libCom/log -I../../../src/libCom/macLib -I../../../src/libCom/misc -I../../../src/libCom/osi -I../../../src/libCom/pool -I../../../src/libCom/ring -I../../../src/libCom/taskwd -I../../../src/libCom/timer -I../../../src/libCom/yacc -I../../../src/libCom/yacc -I../../../src/libCom/yajl -I../../../include/compiler/gcc -I../../../include/os/RTEMS -I../../../include         -MM -MF fdManager.d  ../../../src/libCom/fdmgr/fdManager.cpp
/usr/local/vw/rtems/rtems-4.10.2/bin/../libexec/gcc/m68k-rtems4.10.2/4.4.7/cc1plus: error while loading shared libraries: libmpfr.so.1: cannot open shared object file: No such file or directory
/usr/local/vw/rtems/rtems-4.10.2/bin/m68k-rtems4.10.2-g++ -B/usr/local/rtems/rtems-4.10.2/m68k-rtems4.10.2/uC5282/lib/ -specs bsp_specs -qrtems     -mcpu=5282         -DUSE_TYPED_RSET         -DUNIX      -O2 -g -g   -Wall       -DMY_DO_BOOTP=NULL     -I. -I../O.Common -I. -I../../../src/libCom/osi/compiler/gcc -I../../../src/libCom/osi/compiler/default -I. -I../../../src/libCom/osi/os/RTEMS -I../../../src/libCom/osi/os/posix -I../../../src/libCom/osi/os/default -I.. -I../../../src/libCom/as -I../../../src/libCom/bucketLib -I../../../src/libCom/calc -I../../../src/libCom/cvtFast -I../../../src/libCom/cppStd -I../../../src/libCom/cxxTemplates -I../../../src/libCom/dbmf -I../../../src/libCom/ellLib -I../../../src/libCom/env -I../../../src/libCom/error -I../../../src/libCom/fdmgr -I../../../src/libCom/flex -I../../../src/libCom/freeList -I../../../src/libCom/gpHash -I../../../src/libCom/iocsh -I../../../src/libCom/log -I../../../src/libCom/macLib -I../../../src/libCom/misc -I../../../src/libCom/osi -I../../../src/libCom/pool -I../../../src/libCom/ring -I../../../src/libCom/taskwd -I../../../src/libCom/timer -I../../../src/libCom/yacc -I../../../src/libCom/yacc -I../../../src/libCom/yajl -I../../../include/compiler/gcc -I../../../include/os/RTEMS -I../../../include         -MM -MF fdmgr.d  ../../../src/libCom/fdmgr/fdmgr.cpp
/usr/local/vw/rtems/rtems-4.10.2/bin/../libexec/gcc/m68k-rtems4.10.2/4.4.7/cc1plus: error while loading shared libraries: libmpfr.so.1: cannot open shared object file: No such file or directory
perl -CSD ../../../src/libCom/error/makeStatTbl.pl  ../../../src/libCom/osi/devLib.h ../../../src/libCom/osi/epicsTime.h ../../../src/libCom/as/asLib.h ../../../src/libCom/misc/epicsStdlib.h ../../../src/libCom/pool/epicsThreadPool.h ../../../src/ioc/db/dbAccessDefs.h ../../../src/ioc/dbStatic/devSup.h ../../../src/ioc/dbStatic/drvSup.h ../../../src/ioc/dbStatic/recSup.h ../../../src/ioc/dbStatic/dbStaticLib.h ../../../src/libCom/error/errMdef.h ../../../src/ca/legacy/pcas/generic/casdef.h ../../../src/ca/legacy/gdd/gddAppFuncTable.h
/usr/local/vw/rtems/rtems-4.10.2/bin/m68k-rtems4.10.2-gcc --pipe -B/usr/local/rtems/rtems-4.10.2/m68k-rtems4.10.2/uC5282/lib/ -specs bsp_specs -qrtems   -fasm   -mcpu=5282         -DUSE_TYPED_RSET         -DUNIX      -O2 -g -g   -Wall       -DMY_DO_BOOTP=NULL     -I. -I../O.Common -I. -I../../../src/libCom/osi/compiler/gcc -I../../../src/libCom/osi/compiler/default -I. -I../../../src/libCom/osi/os/RTEMS -I../../../src/libCom/osi/os/posix -I../../../src/libCom/osi/os/default -I.. -I../../../src/libCom/as -I../../../src/libCom/bucketLib -I../../../src/libCom/calc -I../../../src/libCom/cvtFast -I../../../src/libCom/cppStd -I../../../src/libCom/cxxTemplates -I../../../src/libCom/dbmf -I../../../src/libCom/ellLib -I../../../src/libCom/env -I../../../src/libCom/error -I../../../src/libCom/fdmgr -I../../../src/libCom/flex -I../../../src/libCom/freeList -I../../../src/libCom/gpHash -I../../../src/libCom/iocsh -I../../../src/libCom/log -I../../../src/libCom/macLib -I../../../src/libCom/misc -I../../../src/libCom/osi -I../../../src/libCom/pool -I../../../src/libCom/ring -I../../../src/libCom/taskwd -I../../../src/libCom/timer -I../../../src/libCom/yacc -I../../../src/libCom/yacc -I../../../src/libCom/yajl -I../../../include/compiler/gcc -I../../../include/os/RTEMS -I../../../include         -MM -MF errSymTbl.d  errSymTbl.c
/usr/local/vw/rtems/rtems-4.10.2/bin/../libexec/gcc/m68k-rtems4.10.2/4.4.7/cc1: error while loading shared libraries: libmpfr.so.1: cannot open shared object file: No such file or directory
/usr/local/vw/rtems/rtems-4.10.2/bin/m68k-rtems4.10.2-gcc --pipe -B/usr/local/rtems/rtems-4.10.2/m68k-rtems4.10.2/uC5282/lib/ -specs bsp_specs -qrtems   -fasm   -mcpu=5282         -DUSE_TYPED_RSET         -DUNIX      -O2 -g -g   -Wall       -DMY_DO_BOOTP=NULL     -I. -I../O.Common -I. -I../../../src/libCom/osi/compiler/gcc -I../../../src/libCom/osi/compiler/default -I. -I../../../src/libCom/osi/os/RTEMS -I../../../src/libCom/osi/os/posix -I../../../src/libCom/osi/os/default -I.. -I../../../src/libCom/as -I../../../src/libCom/bucketLib -I../../../src/libCom/calc -I../../../src/libCom/cvtFast -I../../../src/libCom/cppStd -I../../../src/libCom/cxxTemplates -I../../../src/libCom/dbmf -I../../../src/libCom/ellLib -I../../../src/libCom/env -I../../../src/libCom/error -I../../../src/libCom/fdmgr -I../../../src/libCom/flex -I../../../src/libCom/freeList -I../../../src/libCom/gpHash -I../../../src/libCom/iocsh -I../../../src/libCom/log -I../../../src/libCom/macLib -I../../../src/libCom/misc -I../../../src/libCom/osi -I../../../src/libCom/pool -I../../../src/libCom/ring -I../../../src/libCom/taskwd -I../../../src/libCom/timer -I../../../src/libCom/yacc -I../../../src/libCom/yacc -I../../../src/libCom/yajl -I../../../include/compiler/gcc -I../../../include/os/RTEMS -I../../../include         -MM -MF errSymLib.d  ../../../src/libCom/error/errSymLib.c
/usr/local/vw/rtems/rtems-4.10.2/bin/../libexec/gcc/m68k-rtems4.10.2/4.4.7/cc1: error while loading shared libraries: libmpfr.so.1: cannot open shared object file: No such file or directory
/usr/local/vw/rtems/rtems-4.10.2/bin/m68k-rtems4.10.2-gcc --pipe -B/usr/local/rtems/rtems-4.10.2/m68k-rtems4.10.2/uC5282/lib/ -specs bsp_specs -qrtems   -fasm   -mcpu=5282         -DUSE_TYPED_RSET         -DUNIX      -O2 -g -g   -Wall       -DMY_DO_BOOTP=NULL     -I. -I../O.Common -I. -I../../../src/libCom/osi/compiler/gcc -I../../../src/libCom/osi/compiler/default -I. -I../../../src/libCom/osi/os/RTEMS -I../../../src/libCom/osi/os/posix -I../../../src/libCom/osi/os/default -I.. -I../../../src/libCom/as -I../../../src/libCom/bucketLib -I../../../src/libCom/calc -I../../../src/libCom/cvtFast -I../../../src/libCom/cppStd -I../../../src/libCom/cxxTemplates -I../../../src/libCom/dbmf -I../../../src/libCom/ellLib -I../../../src/libCom/env -I../../../src/libCom/error -I../../../src/libCom/fdmgr -I../../../src/libCom/flex -I../../../src/libCom/freeList -I../../../src/libCom/gpHash -I../../../src/libCom/iocsh -I../../../src/libCom/log -I../../../src/libCom/macLib -I../../../src/libCom/misc -I../../../src/libCom/osi -I../../../src/libCom/pool -I../../../src/libCom/ring -I../../../src/libCom/taskwd -I../../../src/libCom/timer -I../../../src/libCom/yacc -I../../../src/libCom/yacc -I../../../src/libCom/yajl -I../../../include/compiler/gcc -I../../../include/os/RTEMS -I../../../include         -MM -MF errlog.d  ../../../src/libCom/error/errlog.c
/usr/local/vw/rtems/rtems-4.10.2/bin/../libexec/gcc/m68k-rtems4.10.2/4.4.7/cc1: error while loading shared libraries: libmpfr.so.1: cannot open shared object file: No such file or directory
perl -CSD ../../../src/libCom/env/bldEnvData.pl  -t RTEMS-uC5282 \
	-c gcc -s RTEMS ../../../configure
Generating envData.c
/usr/local/vw/rtems/rtems-4.10.2/bin/m68k-rtems4.10.2-gcc --pipe -B/usr/local/rtems/rtems-4.10.2/m68k-rtems4.10.2/uC5282/lib/ -specs bsp_specs -qrtems   -fasm   -mcpu=5282         -DUSE_TYPED_RSET         -DUNIX      -O2 -g -g   -Wall       -DMY_DO_BOOTP=NULL     -I. -I../O.Common -I. -I../../../src/libCom/osi/compiler/gcc -I../../../src/libCom/osi/compiler/default -I. -I../../../src/libCom/osi/os/RTEMS -I../../../src/libCom/osi/os/posix -I../../../src/libCom/osi/os/default -I.. -I../../../src/libCom/as -I../../../src/libCom/bucketLib -I../../../src/libCom/calc -I../../../src/libCom/cvtFast -I../../../src/libCom/cppStd -I../../../src/libCom/cxxTemplates -I../../../src/libCom/dbmf -I../../../src/libCom/ellLib -I../../../src/libCom/env -I../../../src/libCom/error -I../../../src/libCom/fdmgr -I../../../src/libCom/flex -I../../../src/libCom/freeList -I../../../src/libCom/gpHash -I../../../src/libCom/iocsh -I../../../src/libCom/log -I../../../src/libCom/macLib -I../../../src/libCom/misc -I../../../src/libCom/osi -I../../../src/libCom/pool -I../../../src/libCom/ring -I../../../src/libCom/taskwd -I../../../src/libCom/timer -I../../../src/libCom/yacc -I../../../src/libCom/yacc -I../../../src/libCom/yajl -I../../../include/compiler/gcc -I../../../include/os/RTEMS -I../../../include         -MM -MF envData.d  envData.c
/usr/local/vw/rtems/rtems-4.10.2/bin/../libexec/gcc/m68k-rtems4.10.2/4.4.7/cc1: error while loading shared libraries: libmpfr.so.1: cannot open shared object file: No such file or directory
/usr/local/vw/rtems/rtems-4.10.2/bin/m68k-rtems4.10.2-gcc --pipe -B/usr/local/rtems/rtems-4.10.2/m68k-rtems4.10.2/uC5282/lib/ -specs bsp_specs -qrtems   -fasm   -mcpu=5282         -DUSE_TYPED_RSET         -DUNIX      -O2 -g -g   -Wall       -DMY_DO_BOOTP=NULL     -I. -I../O.Common -I. -I../../../src/libCom/osi/compiler/gcc -I../../../src/libCom/osi/compiler/default -I. -I../../../src/libCom/osi/os/RTEMS -I../../../src/libCom/osi/os/posix -I../../../src/libCom/osi/os/default -I.. -I../../../src/libCom/as -I../../../src/libCom/bucketLib -I../../../src/libCom/calc -I../../../src/libCom/cvtFast -I../../../src/libCom/cppStd -I../../../src/libCom/cxxTemplates -I../../../src/libCom/dbmf -I../../../src/libCom/ellLib -I../../../src/libCom/env -I../../../src/libCom/error -I../../../src/libCom/fdmgr -I../../../src/libCom/flex -I../../../src/libCom/freeList -I../../../src/libCom/gpHash -I../../../src/libCom/iocsh -I../../../src/libCom/log -I../../../src/libCom/macLib -I../../../src/libCom/misc -I../../../src/libCom/osi -I../../../src/libCom/pool -I../../../src/libCom/ring -I../../../src/libCom/taskwd -I../../../src/libCom/timer -I../../../src/libCom/yacc -I../../../src/libCom/yacc -I../../../src/libCom/yajl -I../../../include/compiler/gcc -I../../../include/os/RTEMS -I../../../include         -MM -MF envSubr.d  ../../../src/libCom/env/envSubr.c
/usr/local/vw/rtems/rtems-4.10.2/bin/../libexec/gcc/m68k-rtems4.10.2/4.4.7/cc1: error while loading shared libraries: libmpfr.so.1: cannot open shared object file: No such file or directory
/usr/local/vw/rtems/rtems-4.10.2/bin/m68k-rtems4.10.2-gcc --pipe -B/usr/local/rtems/rtems-4.10.2/m68k-rtems4.10.2/uC5282/lib/ -specs bsp_specs -qrtems   -fasm   -mcpu=5282         -DUSE_TYPED_RSET         -DUNIX      -O2 -g -g   -Wall       -DMY_DO_BOOTP=NULL     -I. -I../O.Common -I. -I../../../src/libCom/osi/compiler/gcc -I../../../src/libCom/osi/compiler/default -I. -I../../../src/libCom/osi/os/RTEMS -I../../../src/libCom/osi/os/posix -I../../../src/libCom/osi/os/default -I.. -I../../../src/libCom/as -I../../../src/libCom/bucketLib -I../../../src/libCom/calc -I../../../src/libCom/cvtFast -I../../../src/libCom/cppStd -I../../../src/libCom/cxxTemplates -I../../../src/libCom/dbmf -I../../../src/libCom/ellLib -I../../../src/libCom/env -I../../../src/libCom/error -I../../../src/libCom/fdmgr -I../../../src/libCom/flex -I../../../src/libCom/freeList -I../../../src/libCom/gpHash -I../../../src/libCom/iocsh -I../../../src/libCom/log -I../../../src/libCom/macLib -I../../../src/libCom/misc -I../../../src/libCom/osi -I../../../src/libCom/pool -I../../../src/libCom/ring -I../../../src/libCom/taskwd -I../../../src/libCom/timer -I../../../src/libCom/yacc -I../../../src/libCom/yacc -I../../../src/libCom/yajl -I../../../include/compiler/gcc -I../../../include/os/RTEMS -I../../../include         -MM -MF ellSort.d  ../../../src/libCom/ellLib/ellSort.c
/usr/local/vw/rtems/rtems-4.10.2/bin/../libexec/gcc/m68k-rtems4.10.2/4.4.7/cc1: error while loading shared libraries: libmpfr.so.1: cannot open shared object file: No such file or directory
/usr/local/vw/rtems/rtems-4.10.2/bin/m68k-rtems4.10.2-gcc --pipe -B/usr/local/rtems/rtems-4.10.2/m68k-rtems4.10.2/uC5282/lib/ -specs bsp_specs -qrtems   -fasm   -mcpu=5282         -DUSE_TYPED_RSET         -DUNIX      -O2 -g -g   -Wall       -DMY_DO_BOOTP=NULL     -I. -I../O.Common -I. -I../../../src/libCom/osi/compiler/gcc -I../../../src/libCom/osi/compiler/default -I. -I../../../src/libCom/osi/os/RTEMS -I../../../src/libCom/osi/os/posix -I../../../src/libCom/osi/os/default -I.. -I../../../src/libCom/as -I../../../src/libCom/bucketLib -I../../../src/libCom/calc -I../../../src/libCom/cvtFast -I../../../src/libCom/cppStd -I../../../src/libCom/cxxTemplates -I../../../src/libCom/dbmf -I../../../src/libCom/ellLib -I../../../src/libCom/env -I../../../src/libCom/error -I../../../src/libCom/fdmgr -I../../../src/libCom/flex -I../../../src/libCom/freeList -I../../../src/libCom/gpHash -I../../../src/libCom/iocsh -I../../../src/libCom/log -I../../../src/libCom/macLib -I../../../src/libCom/misc -I../../../src/libCom/osi -I../../../src/libCom/pool -I../../../src/libCom/ring -I../../../src/libCom/taskwd -I../../../src/libCom/timer -I../../../src/libCom/yacc -I../../../src/libCom/yacc -I../../../src/libCom/yajl -I../../../include/compiler/gcc -I../../../include/os/RTEMS -I../../../include         -MM -MF ellLib.d  ../../../src/libCom/ellLib/ellLib.c
/usr/local/vw/rtems/rtems-4.10.2/bin/../libexec/gcc/m68k-rtems4.10.2/4.4.7/cc1: error while loading shared libraries: libmpfr.so.1: cannot open shared object file: No such file or directory
/usr/local/vw/rtems/rtems-4.10.2/bin/m68k-rtems4.10.2-gcc --pipe -B/usr/local/rtems/rtems-4.10.2/m68k-rtems4.10.2/uC5282/lib/ -specs bsp_specs -qrtems   -fasm   -mcpu=5282         -DUSE_TYPED_RSET         -DUNIX      -O2 -g -g   -Wall       -DMY_DO_BOOTP=NULL     -I. -I../O.Common -I. -I../../../src/libCom/osi/compiler/gcc -I../../../src/libCom/osi/compiler/default -I. -I../../../src/libCom/osi/os/RTEMS -I../../../src/libCom/osi/os/posix -I../../../src/libCom/osi/os/default -I.. -I../../../src/libCom/as -I../../../src/libCom/bucketLib -I../../../src/libCom/calc -I../../../src/libCom/cvtFast -I../../../src/libCom/cppStd -I../../../src/libCom/cxxTemplates -I../../../src/libCom/dbmf -I../../../src/libCom/ellLib -I../../../src/libCom/env -I../../../src/libCom/error -I../../../src/libCom/fdmgr -I../../../src/libCom/flex -I../../../src/libCom/freeList -I../../../src/libCom/gpHash -I../../../src/libCom/iocsh -I../../../src/libCom/log -I../../../src/libCom/macLib -I../../../src/libCom/misc -I../../../src/libCom/osi -I../../../src/libCom/pool -I../../../src/libCom/ring -I../../../src/libCom/taskwd -I../../../src/libCom/timer -I../../../src/libCom/yacc -I../../../src/libCom/yacc -I../../../src/libCom/yajl -I../../../include/compiler/gcc -I../../../include/os/RTEMS -I../../../include         -MM -MF dbmf.d  ../../../src/libCom/dbmf/dbmf.c
/usr/local/vw/rtems/rtems-4.10.2/bin/../libexec/gcc/m68k-rtems4.10.2/4.4.7/cc1: error while loading shared libraries: libmpfr.so.1: cannot open shared object file: No such file or directory
/usr/local/vw/rtems/rtems-4.10.2/bin/m68k-rtems4.10.2-g++ -B/usr/local/rtems/rtems-4.10.2/m68k-rtems4.10.2/uC5282/lib/ -specs bsp_specs -qrtems     -mcpu=5282         -DUSE_TYPED_RSET         -DUNIX      -O2 -g -g   -Wall       -DMY_DO_BOOTP=NULL     -I. -I../O.Common -I. -I../../../src/libCom/osi/compiler/gcc -I../../../src/libCom/osi/compiler/default -I. -I../../../src/libCom/osi/os/RTEMS -I../../../src/libCom/osi/os/posix -I../../../src/libCom/osi/os/default -I.. -I../../../src/libCom/as -I../../../src/libCom/bucketLib -I../../../src/libCom/calc -I../../../src/libCom/cvtFast -I../../../src/libCom/cppStd -I../../../src/libCom/cxxTemplates -I../../../src/libCom/dbmf -I../../../src/libCom/ellLib -I../../../src/libCom/env -I../../../src/libCom/error -I../../../src/libCom/fdmgr -I../../../src/libCom/flex -I../../../src/libCom/freeList -I../../../src/libCom/gpHash -I../../../src/libCom/iocsh -I../../../src/libCom/log -I../../../src/libCom/macLib -I../../../src/libCom/misc -I../../../src/libCom/osi -I../../../src/libCom/pool -I../../../src/libCom/ring -I../../../src/libCom/taskwd -I../../../src/libCom/timer -I../../../src/libCom/yacc -I../../../src/libCom/yacc -I../../../src/libCom/yajl -I../../../include/compiler/gcc -I../../../include/os/RTEMS -I../../../include         -MM -MF epicsSingletonMutex.d  ../../../src/libCom/cxxTemplates/epicsSingletonMutex.cpp
/usr/local/vw/rtems/rtems-4.10.2/bin/../libexec/gcc/m68k-rtems4.10.2/4.4.7/cc1plus: error while loading shared libraries: libmpfr.so.1: cannot open shared object file: No such file or directory
/usr/local/vw/rtems/rtems-4.10.2/bin/m68k-rtems4.10.2-g++ -B/usr/local/rtems/rtems-4.10.2/m68k-rtems4.10.2/uC5282/lib/ -specs bsp_specs -qrtems     -mcpu=5282         -DUSE_TYPED_RSET         -DUNIX      -O2 -g -g   -Wall       -DMY_DO_BOOTP=NULL     -I. -I../O.Common -I. -I../../../src/libCom/osi/compiler/gcc -I../../../src/libCom/osi/compiler/default -I. -I../../../src/libCom/osi/os/RTEMS -I../../../src/libCom/osi/os/posix -I../../../src/libCom/osi/os/default -I.. -I../../../src/libCom/as -I../../../src/libCom/bucketLib -I../../../src/libCom/calc -I../../../src/libCom/cvtFast -I../../../src/libCom/cppStd -I../../../src/libCom/cxxTemplates -I../../../src/libCom/dbmf -I../../../src/libCom/ellLib -I../../../src/libCom/env -I../../../src/libCom/error -I../../../src/libCom/fdmgr -I../../../src/libCom/flex -I../../../src/libCom/freeList -I../../../src/libCom/gpHash -I../../../src/libCom/iocsh -I../../../src/libCom/log -I../../../src/libCom/macLib -I../../../src/libCom/misc -I../../../src/libCom/osi -I../../../src/libCom/pool -I../../../src/libCom/ring -I../../../src/libCom/taskwd -I../../../src/libCom/timer -I../../../src/libCom/yacc -I../../../src/libCom/yacc -I../../../src/libCom/yajl -I../../../include/compiler/gcc -I../../../include/os/RTEMS -I../../../include         -MM -MF resourceLib.d  ../../../src/libCom/cxxTemplates/resourceLib.cpp
/usr/local/vw/rtems/rtems-4.10.2/bin/../libexec/gcc/m68k-rtems4.10.2/4.4.7/cc1plus: error while loading shared libraries: libmpfr.so.1: cannot open shared object file: No such file or directory
/usr/local/vw/rtems/rtems-4.10.2/bin/m68k-rtems4.10.2-gcc --pipe -B/usr/local/rtems/rtems-4.10.2/m68k-rtems4.10.2/uC5282/lib/ -specs bsp_specs -qrtems   -fasm   -mcpu=5282         -DUSE_TYPED_RSET         -DUNIX      -O2 -g -g   -Wall       -DMY_DO_BOOTP=NULL     -I. -I../O.Common -I. -I../../../src/libCom/osi/compiler/gcc -I../../../src/libCom/osi/compiler/default -I. -I../../../src/libCom/osi/os/RTEMS -I../../../src/libCom/osi/os/posix -I../../../src/libCom/osi/os/default -I.. -I../../../src/libCom/as -I../../../src/libCom/bucketLib -I../../../src/libCom/calc -I../../../src/libCom/cvtFast -I../../../src/libCom/cppStd -I../../../src/libCom/cxxTemplates -I../../../src/libCom/dbmf -I../../../src/libCom/ellLib -I../../../src/libCom/env -I../../../src/libCom/error -I../../../src/libCom/fdmgr -I../../../src/libCom/flex -I../../../src/libCom/freeList -I../../../src/libCom/gpHash -I../../../src/libCom/iocsh -I../../../src/libCom/log -I../../../src/libCom/macLib -I../../../src/libCom/misc -I../../../src/libCom/osi -I../../../src/libCom/pool -I../../../src/libCom/ring -I../../../src/libCom/taskwd -I../../../src/libCom/timer -I../../../src/libCom/yacc -I../../../src/libCom/yacc -I../../../src/libCom/yajl -I../../../include/compiler/gcc -I../../../include/os/RTEMS -I../../../include         -MM -MF cvtFast.d  ../../../src/libCom/cvtFast/cvtFast.c
/usr/local/vw/rtems/rtems-4.10.2/bin/../libexec/gcc/m68k-rtems4.10.2/4.4.7/cc1: error while loading shared libraries: libmpfr.so.1: cannot open shared object file: No such file or directory
/usr/local/vw/rtems/rtems-4.10.2/bin/m68k-rtems4.10.2-gcc --pipe -B/usr/local/rtems/rtems-4.10.2/m68k-rtems4.10.2/uC5282/lib/ -specs bsp_specs -qrtems   -fasm   -mcpu=5282         -DUSE_TYPED_RSET         -DUNIX      -O2 -g -g   -Wall       -DMY_DO_BOOTP=NULL     -I. -I../O.Common -I. -I../../../src/libCom/osi/compiler/gcc -I../../../src/libCom/osi/compiler/default -I. -I../../../src/libCom/osi/os/RTEMS -I../../../src/libCom/osi/os/posix -I../../../src/libCom/osi/os/default -I.. -I../../../src/libCom/as -I../../../src/libCom/bucketLib -I../../../src/libCom/calc -I../../../src/libCom/cvtFast -I../../../src/libCom/cppStd -I../../../src/libCom/cxxTemplates -I../../../src/libCom/dbmf -I../../../src/libCom/ellLib -I../../../src/libCom/env -I../../../src/libCom/error -I../../../src/libCom/fdmgr -I../../../src/libCom/flex -I../../../src/libCom/freeList -I../../../src/libCom/gpHash -I../../../src/libCom/iocsh -I../../../src/libCom/log -I../../../src/libCom/macLib -I../../../src/libCom/misc -I../../../src/libCom/osi -I../../../src/libCom/pool -I../../../src/libCom/ring -I../../../src/libCom/taskwd -I../../../src/libCom/timer -I../../../src/libCom/yacc -I../../../src/libCom/yacc -I../../../src/libCom/yajl -I../../../include/compiler/gcc -I../../../include/os/RTEMS -I../../../include         -MM -MF calcPerform.d  ../../../src/libCom/calc/calcPerform.c
/usr/local/vw/rtems/rtems-4.10.2/bin/../libexec/gcc/m68k-rtems4.10.2/4.4.7/cc1: error while loading shared libraries: libmpfr.so.1: cannot open shared object file: No such file or directory
/usr/local/vw/rtems/rtems-4.10.2/bin/m68k-rtems4.10.2-gcc --pipe -B/usr/local/rtems/rtems-4.10.2/m68k-rtems4.10.2/uC5282/lib/ -specs bsp_specs -qrtems   -fasm   -mcpu=5282         -DUSE_TYPED_RSET         -DUNIX      -O2 -g -g   -Wall       -DMY_DO_BOOTP=NULL     -I. -I../O.Common -I. -I../../../src/libCom/osi/compiler/gcc -I../../../src/libCom/osi/compiler/default -I. -I../../../src/libCom/osi/os/RTEMS -I../../../src/libCom/osi/os/posix -I../../../src/libCom/osi/os/default -I.. -I../../../src/libCom/as -I../../../src/libCom/bucketLib -I../../../src/libCom/calc -I../../../src/libCom/cvtFast -I../../../src/libCom/cppStd -I../../../src/libCom/cxxTemplates -I../../../src/libCom/dbmf -I../../../src/libCom/ellLib -I../../../src/libCom/env -I../../../src/libCom/error -I../../../src/libCom/fdmgr -I../../../src/libCom/flex -I../../../src/libCom/freeList -I../../../src/libCom/gpHash -I../../../src/libCom/iocsh -I../../../src/libCom/log -I../../../src/libCom/macLib -I../../../src/libCom/misc -I../../../src/libCom/osi -I../../../src/libCom/pool -I../../../src/libCom/ring -I../../../src/libCom/taskwd -I../../../src/libCom/timer -I../../../src/libCom/yacc -I../../../src/libCom/yacc -I../../../src/libCom/yajl -I../../../include/compiler/gcc -I../../../include/os/RTEMS -I../../../include         -MM -MF postfix.d  ../../../src/libCom/calc/postfix.c
/usr/local/vw/rtems/rtems-4.10.2/bin/../libexec/gcc/m68k-rtems4.10.2/4.4.7/cc1: error while loading shared libraries: libmpfr.so.1: cannot open shared object file: No such file or directory
/usr/local/vw/rtems/rtems-4.10.2/bin/m68k-rtems4.10.2-gcc --pipe -B/usr/local/rtems/rtems-4.10.2/m68k-rtems4.10.2/uC5282/lib/ -specs bsp_specs -qrtems   -fasm   -mcpu=5282         -DUSE_TYPED_RSET         -DUNIX      -O2 -g -g   -Wall       -DMY_DO_BOOTP=NULL     -I. -I../O.Common -I. -I../../../src/libCom/osi/compiler/gcc -I../../../src/libCom/osi/compiler/default -I. -I../../../src/libCom/osi/os/RTEMS -I../../../src/libCom/osi/os/posix -I../../../src/libCom/osi/os/default -I.. -I../../../src/libCom/as -I../../../src/libCom/bucketLib -I../../../src/libCom/calc -I../../../src/libCom/cvtFast -I../../../src/libCom/cppStd -I../../../src/libCom/cxxTemplates -I../../../src/libCom/dbmf -I../../../src/libCom/ellLib -I../../../src/libCom/env -I../../../src/libCom/error -I../../../src/libCom/fdmgr -I../../../src/libCom/flex -I../../../src/libCom/freeList -I../../../src/libCom/gpHash -I../../../src/libCom/iocsh -I../../../src/libCom/log -I../../../src/libCom/macLib -I../../../src/libCom/misc -I../../../src/libCom/osi -I../../../src/libCom/pool -I../../../src/libCom/ring -I../../../src/libCom/taskwd -I../../../src/libCom/timer -I../../../src/libCom/yacc -I../../../src/libCom/yacc -I../../../src/libCom/yajl -I../../../include/compiler/gcc -I../../../include/os/RTEMS -I../../../include         -MM -MF bucketLib.d  ../../../src/libCom/bucketLib/bucketLib.c
/usr/local/vw/rtems/rtems-4.10.2/bin/../libexec/gcc/m68k-rtems4.10.2/4.4.7/cc1: error while loading shared libraries: libmpfr.so.1: cannot open shared object file: No such file or directory
/usr/local/vw/rtems/rtems-4.10.2/bin/m68k-rtems4.10.2-gcc --pipe -B/usr/local/rtems/rtems-4.10.2/m68k-rtems4.10.2/uC5282/lib/ -specs bsp_specs -qrtems   -fasm   -mcpu=5282         -DUSE_TYPED_RSET         -DUNIX      -O2 -g -g   -Wall       -DMY_DO_BOOTP=NULL     -I. -I../O.Common -I. -I../../../src/libCom/osi/compiler/gcc -I../../../src/libCom/osi/compiler/default -I. -I../../../src/libCom/osi/os/RTEMS -I../../../src/libCom/osi/os/posix -I../../../src/libCom/osi/os/default -I.. -I../../../src/libCom/as -I../../../src/libCom/bucketLib -I../../../src/libCom/calc -I../../../src/libCom/cvtFast -I../../../src/libCom/cppStd -I../../../src/libCom/cxxTemplates -I../../../src/libCom/dbmf -I../../../src/libCom/ellLib -I../../../src/libCom/env -I../../../src/libCom/error -I../../../src/libCom/fdmgr -I../../../src/libCom/flex -I../../../src/libCom/freeList -I../../../src/libCom/gpHash -I../../../src/libCom/iocsh -I../../../src/libCom/log -I../../../src/libCom/macLib -I../../../src/libCom/misc -I../../../src/libCom/osi -I../../../src/libCom/pool -I../../../src/libCom/ring -I../../../src/libCom/taskwd -I../../../src/libCom/timer -I../../../src/libCom/yacc -I../../../src/libCom/yacc -I../../../src/libCom/yajl -I../../../include/compiler/gcc -I../../../include/os/RTEMS -I../../../include         -MM -MF asTrapWrite.d  ../../../src/libCom/as/asTrapWrite.c
/usr/local/vw/rtems/rtems-4.10.2/bin/../libexec/gcc/m68k-rtems4.10.2/4.4.7/cc1: error while loading shared libraries: libmpfr.so.1: cannot open shared object file: No such file or directory
/Jenkins/jenkins/jobs/epics-base-3.16/workspace/bin/linux-x86_64/e_flex -S../../../include/flex.skel.static -8 -I -t ../../../src/libCom/as/asLib_lex.l > asLib_lex.yy.c
/bin/mv asLib_lex.yy.c asLib_lex.c
/Jenkins/jenkins/jobs/epics-base-3.16/workspace/bin/linux-x86_64/antelope -basLib  ../../../src/libCom/as/asLib.y
/bin/mv asLib.tab.c asLib.c
/usr/local/vw/rtems/rtems-4.10.2/bin/m68k-rtems4.10.2-gcc --pipe -B/usr/local/rtems/rtems-4.10.2/m68k-rtems4.10.2/uC5282/lib/ -specs bsp_specs -qrtems   -fasm   -mcpu=5282         -DUSE_TYPED_RSET         -DUNIX      -O2 -g -g   -Wall       -DMY_DO_BOOTP=NULL     -I. -I../O.Common -I. -I../../../src/libCom/osi/compiler/gcc -I../../../src/libCom/osi/compiler/default -I. -I../../../src/libCom/osi/os/RTEMS -I../../../src/libCom/osi/os/posix -I../../../src/libCom/osi/os/default -I.. -I../../../src/libCom/as -I../../../src/libCom/bucketLib -I../../../src/libCom/calc -I../../../src/libCom/cvtFast -I../../../src/libCom/cppStd -I../../../src/libCom/cxxTemplates -I../../../src/libCom/dbmf -I../../../src/libCom/ellLib -I../../../src/libCom/env -I../../../src/libCom/error -I../../../src/libCom/fdmgr -I../../../src/libCom/flex -I../../../src/libCom/freeList -I../../../src/libCom/gpHash -I../../../src/libCom/iocsh -I../../../src/libCom/log -I../../../src/libCom/macLib -I../../../src/libCom/misc -I../../../src/libCom/osi -I../../../src/libCom/pool -I../../../src/libCom/ring -I../../../src/libCom/taskwd -I../../../src/libCom/timer -I../../../src/libCom/yacc -I../../../src/libCom/yacc -I../../../src/libCom/yajl -I../../../include/compiler/gcc -I../../../include/os/RTEMS -I../../../include         -MM -MF asLib.d  asLib.c
/usr/local/vw/rtems/rtems-4.10.2/bin/../libexec/gcc/m68k-rtems4.10.2/4.4.7/cc1: error while loading shared libraries: libmpfr.so.1: cannot open shared object file: No such file or directory
Installing OS dependent include file ../../../include/os/RTEMS/osiFileName.h
mkdir ../../../include/os/RTEMS
Installing OS dependent include file ../../../include/os/RTEMS/osdSock.h
Installing OS dependent include file ../../../include/os/RTEMS/osdInterrupt.h
Installing OS dependent include file ../../../include/os/RTEMS/osdMutex.h
Installing OS dependent include file ../../../include/os/RTEMS/osdEvent.h
Installing OS dependent include file ../../../include/os/RTEMS/epicsMath.h
Installing OS dependent include file ../../../include/os/RTEMS/osdMessageQueue.h
Installing OS dependent include file ../../../include/os/RTEMS/osdStrtod.h
Installing OS dependent include file ../../../include/os/RTEMS/osdPoolStatus.h
Installing OS dependent include file ../../../include/os/RTEMS/osdThread.h
Installing OS dependent include file ../../../include/os/RTEMS/osdTime.h
Installing OS dependent include file ../../../include/os/RTEMS/osiUnistd.h
Installing OS dependent include file ../../../include/os/RTEMS/osdWireFormat.h
Installing OS dependent include file ../../../include/os/RTEMS/osdWireConfig.h
Installing OS dependent include file ../../../include/os/RTEMS/epicsAtomicOSD.h
Installing OS dependent include file ../../../include/os/RTEMS/epicsGetopt.h
Installing OS dependent include file ../../../include/os/RTEMS/osdVME.h
Installing OS dependent include file ../../../include/os/RTEMS/epicsMMIO.h
Installing OS dependent include file ../../../include/os/RTEMS/epicsMMIODef.h
/usr/local/vw/rtems/rtems-4.10.2/bin/m68k-rtems4.10.2-gcc --pipe -B/usr/local/rtems/rtems-4.10.2/m68k-rtems4.10.2/uC5282/lib/ -specs bsp_specs -qrtems   -fasm   -mcpu=5282         -DUSE_TYPED_RSET         -DUNIX      -O2 -g -g   -Wall       -DMY_DO_BOOTP=NULL     -I. -I../O.Common -I. -I../../../src/libCom/osi/compiler/gcc -I../../../src/libCom/osi/compiler/default -I. -I../../../src/libCom/osi/os/RTEMS -I../../../src/libCom/osi/os/posix -I../../../src/libCom/osi/os/default -I.. -I../../../src/libCom/as -I../../../src/libCom/bucketLib -I../../../src/libCom/calc -I../../../src/libCom/cvtFast -I../../../src/libCom/cppStd -I../../../src/libCom/cxxTemplates -I../../../src/libCom/dbmf -I../../../src/libCom/ellLib -I../../../src/libCom/env -I../../../src/libCom/error -I../../../src/libCom/fdmgr -I../../../src/libCom/flex -I../../../src/libCom/freeList -I../../../src/libCom/gpHash -I../../../src/libCom/iocsh -I../../../src/libCom/log -I../../../src/libCom/macLib -I../../../src/libCom/misc -I../../../src/libCom/osi -I../../../src/libCom/pool -I../../../src/libCom/ring -I../../../src/libCom/taskwd -I../../../src/libCom/timer -I../../../src/libCom/yacc -I../../../src/libCom/yacc -I../../../src/libCom/yajl -I../../../include/compiler/gcc -I../../../include/os/RTEMS -I../../../include         -c asLib.c
/usr/local/vw/rtems/rtems-4.10.2/bin/../libexec/gcc/m68k-rtems4.10.2/4.4.7/cc1: error while loading shared libraries: libmpfr.so.1: cannot open shared object file: No such file or directory
make[3]: *** [asLib.o] Error 1
make[3]: Leaving directory `/Jenkins/jenkins/jobs/epics-base-3.16/workspace/src/libCom/O.RTEMS-uC5282'
make[2]: *** [RTEMS-uC5282] Error 2
make[2]: Leaving directory `/Jenkins/jenkins/jobs/epics-base-3.16/workspace/src/libCom'
make[1]: *** [libCom.RTEMS-uC5282] Error 2
make[1]: Leaving directory `/Jenkins/jenkins/jobs/epics-base-3.16/workspace/src'
make: *** [src.RTEMS-uC5282] Error 2
Build step 'Execute shell' marked build as failure
[WARNINGS] Skipping publisher since build result is FAILURE

Replies:
Jenkins build is back to normal : epics-base-3.16-rtems #134 APS Jenkins

Navigate by Date:
Prev: Re: Java PvaClientMonitor questions Marty Kraimer
Next: Build failed in Jenkins: epics-base-3.16-win64 #128 APS Jenkins
Index: 2002  2003  2004  2005  2006  2007  2008  2009  2010  2011  2012  2013  2014  2015  2016  <2017
Navigate by Thread:
Prev: Re: EPICS Base dev release numbering Ralph Lange
Next: Jenkins build is back to normal : epics-base-3.16-rtems #134 APS Jenkins
Index: 2002  2003  2004  2005  2006  2007  2008  2009  2010  2011  2012  2013  2014  2015  2016  <2017
ANJ, 05 Jul 2017 Valid HTML 4.01! · Home · News · About · Base · Modules · Extensions · Distributions · Download ·
· EPICS V4 · IRMIS · Talk · Bugs · Documents · Links · Licensing ·