Argonne National Laboratory

Experimental Physics and
Industrial Control System

2002  2003  2004  2005  2006  2007  2008  2009  2010  2011  2012  2013  2014  2015  2016  <2017 Index 2002  2003  2004  2005  2006  2007  2008  2009  2010  2011  2012  2013  2014  2015  2016  <2017
<== Date ==> <== Thread ==>

Subject: Build failed in Jenkins: epics-base-3.15-win64-test #134
From: APS Jenkins <aps-jenkins@anl.gov>
To: core-talk@aps.anl.gov
Date: Thu, 22 Jun 2017 17:06:11 -0500 (CDT)
See <https://jenkins.aps.anl.gov/job/epics-base-3.15-win64-test/134/display/redirect>

------------------------------------------
[...truncated 18.62 KB...]
make: Leaving directory '<https://jenkins.aps.anl.gov/job/epics-base-3.15-win64-test/ws/src'>

C:\jenkins\win64-1\workspace\epics-base-3.15-win64>make test-results 
make -C ./configure test-results 
make[1]: Entering directory '<https://jenkins.aps.anl.gov/job/epics-base-3.15-win64-test/ws/configure'>
make -C O.windows-x64 -f ../Makefile TOP=../.. \
    T_A=windows-x64 test-results
make[2]: Entering directory '<https://jenkins.aps.anl.gov/job/epics-base-3.15-win64-test/ws/configure/O.windows-x64'>
make[2]: Nothing to be done for 'test-results'.
make[2]: Leaving directory '<https://jenkins.aps.anl.gov/job/epics-base-3.15-win64-test/ws/configure/O.windows-x64'>
make[1]: Leaving directory '<https://jenkins.aps.anl.gov/job/epics-base-3.15-win64-test/ws/configure'>
make -C ./src test-results 
make[1]: Entering directory '<https://jenkins.aps.anl.gov/job/epics-base-3.15-win64-test/ws/src'>
make -C ./tools test-results 
make[2]: Entering directory '<https://jenkins.aps.anl.gov/job/epics-base-3.15-win64-test/ws/src/tools'>
make -C O.windows-x64 -f ../Makefile TOP=../../.. \
    T_A=windows-x64 test-results
make[3]: Entering directory '<https://jenkins.aps.anl.gov/job/epics-base-3.15-win64-test/ws/src/tools/O.windows-x64'>
make[3]: Nothing to be done for 'test-results'.
make[3]: Leaving directory '<https://jenkins.aps.anl.gov/job/epics-base-3.15-win64-test/ws/src/tools/O.windows-x64'>
make[2]: Leaving directory '<https://jenkins.aps.anl.gov/job/epics-base-3.15-win64-test/ws/src/tools'>
make -C tools/test test-results 
make[2]: Entering directory '<https://jenkins.aps.anl.gov/job/epics-base-3.15-win64-test/ws/src/tools/test'>
make -C O.windows-x64 -f ../Makefile TOP=../../../.. \
    T_A=windows-x64 test-results
make[3]: Entering directory '<https://jenkins.aps.anl.gov/job/epics-base-3.15-win64-test/ws/src/tools/test/O.windows-x64'>
prove --failures --ext .tap --exec "perl -CSD -MExtUtils::Command -e cat" --color Breaktable.tap DBD.tap Device.tap Driver.tap Function.tap macLib.tap Menu.tap Recfield.tap Recordtype.tap Registrar.tap Snippets.tap Variable.tap
Breaktable.tap .. ok
DBD.tap ......... ok
Device.tap ...... ok
Driver.tap ...... ok
Function.tap .... ok
macLib.tap ...... ok
Menu.tap ........ ok
Recfield.tap .... ok
Recordtype.tap .. ok
Registrar.tap ... ok
Snippets.tap .... ok
Variable.tap .... ok
All tests successful.
Files=12, Tests=224,  2 wallclock secs ( 0.16 usr +  0.14 sys =  0.30 CPU)
Result: PASS
make[3]: Leaving directory '<https://jenkins.aps.anl.gov/job/epics-base-3.15-win64-test/ws/src/tools/test/O.windows-x64'>
make[2]: Leaving directory '<https://jenkins.aps.anl.gov/job/epics-base-3.15-win64-test/ws/src/tools/test'>
make -C template/base test-results 
make[2]: Entering directory '<https://jenkins.aps.anl.gov/job/epics-base-3.15-win64-test/ws/src/template/base'>
make -C O.windows-x64 -f ../Makefile TOP=../../../.. \
    T_A=windows-x64 test-results
make[3]: Entering directory '<https://jenkins.aps.anl.gov/job/epics-base-3.15-win64-test/ws/src/template/base/O.windows-x64'>
make[3]: Nothing to be done for 'test-results'.
make[3]: Leaving directory '<https://jenkins.aps.anl.gov/job/epics-base-3.15-win64-test/ws/src/template/base/O.windows-x64'>
make[2]: Leaving directory '<https://jenkins.aps.anl.gov/job/epics-base-3.15-win64-test/ws/src/template/base'>
make -C template/ext test-results 
make[2]: Entering directory '<https://jenkins.aps.anl.gov/job/epics-base-3.15-win64-test/ws/src/template/ext'>
make -C O.windows-x64 -f ../Makefile TOP=../../../.. \
    T_A=windows-x64 test-results
make[3]: Entering directory '<https://jenkins.aps.anl.gov/job/epics-base-3.15-win64-test/ws/src/template/ext/O.windows-x64'>
make[3]: Nothing to be done for 'test-results'.
make[3]: Leaving directory '<https://jenkins.aps.anl.gov/job/epics-base-3.15-win64-test/ws/src/template/ext/O.windows-x64'>
make[2]: Leaving directory '<https://jenkins.aps.anl.gov/job/epics-base-3.15-win64-test/ws/src/template/ext'>
make -C ./libCom test-results 
make[2]: Entering directory '<https://jenkins.aps.anl.gov/job/epics-base-3.15-win64-test/ws/src/libCom'>
make -C O.windows-x64 -f ../Makefile TOP=../../.. \
    T_A=windows-x64 test-results
make[3]: Entering directory '<https://jenkins.aps.anl.gov/job/epics-base-3.15-win64-test/ws/src/libCom/O.windows-x64'>
make[3]: Nothing to be done for 'test-results'.
make[3]: Leaving directory '<https://jenkins.aps.anl.gov/job/epics-base-3.15-win64-test/ws/src/libCom/O.windows-x64'>
make[2]: Leaving directory '<https://jenkins.aps.anl.gov/job/epics-base-3.15-win64-test/ws/src/libCom'>
make -C libCom/RTEMS test-results 
make[2]: Entering directory '<https://jenkins.aps.anl.gov/job/epics-base-3.15-win64-test/ws/src/libCom/RTEMS'>
make -C O.windows-x64 -f ../Makefile TOP=../../../.. \
    T_A=windows-x64 test-results
make[3]: Entering directory '<https://jenkins.aps.anl.gov/job/epics-base-3.15-win64-test/ws/src/libCom/RTEMS/O.windows-x64'>
make[3]: Nothing to be done for 'test-results'.
make[3]: Leaving directory '<https://jenkins.aps.anl.gov/job/epics-base-3.15-win64-test/ws/src/libCom/RTEMS/O.windows-x64'>
make[2]: Leaving directory '<https://jenkins.aps.anl.gov/job/epics-base-3.15-win64-test/ws/src/libCom/RTEMS'>
make -C libCom/test test-results 
make[2]: Entering directory '<https://jenkins.aps.anl.gov/job/epics-base-3.15-win64-test/ws/src/libCom/test'>
make -C O.windows-x64 -f ../Makefile TOP=../../../.. \
    T_A=windows-x64 test-results
make[3]: Entering directory '<https://jenkins.aps.anl.gov/job/epics-base-3.15-win64-test/ws/src/libCom/test/O.windows-x64'>
prove --failures --ext .tap --exec "perl -CSD -MExtUtils::Command -e cat" --color epicsUnitTestTest.tap epicsTypesTest.tap epicsInlineTest.tap epicsCalcTest.tap epicsAlgorithmTest.tap epicsMathTest.tap epicsMMIOTest.tap epicsEllTest.tap epicsEnvTest.tap epicsErrlogTest.tap epicsStdioTest.tap epicsStdlibTest.tap epicsSockResolveTest.tap epicsStringTest.tap epicsTimeTest.tap epicsTimeZoneTest.tap epicsThreadTest.tap epicsThreadOnceTest.tap epicsThreadPriorityTest.tap epicsThreadPrivateTest.tap epicsThreadHooksTest.tap epicsThreadPoolTest.tap epicsExitTest.tap epicsTimerTest.tap ringPointerTest.tap ringBytesTest.tap epicsEventTest.tap epicsMutexTest.tap epicsSpinTest.tap epicsAtomicTest.tap macDefExpandTest.tap macLibTest.tap taskwdTest.tap blockingSockTest.tap epicsMessageQueueTest.tap epicsStackTraceTest.tap ipAddrToAsciiTest.tap
epicsUnitTestTest.tap ........ ok
epicsTypesTest.tap ........... ok
epicsInlineTest.tap .......... ok
epicsCalcTest.tap ............ ok
epicsAlgorithmTest.tap ....... ok
epicsMathTest.tap ............ ok
epicsMMIOTest.tap ............ ok
epicsEllTest.tap ............. ok
epicsEnvTest.tap ............. ok
epicsErrlogTest.tap .......... ok
epicsStdioTest.tap ........... ok
epicsStdlibTest.tap .......... ok
epicsSockResolveTest.tap ..... ok
epicsStringTest.tap .......... ok
epicsTimeTest.tap ............ ok
epicsTimeZoneTest.tap ........ ok
epicsThreadTest.tap .......... ok
epicsThreadOnceTest.tap ...... ok
epicsThreadPriorityTest.tap .. ok
epicsThreadPrivateTest.tap ... ok
epicsThreadHooksTest.tap ..... ok
epicsThreadPoolTest.tap ...... ok
epicsExitTest.tap ............ ok
epicsTimerTest.tap ........... ok
ringPointerTest.tap .......... ok
ringBytesTest.tap ............ ok
epicsEventTest.tap ........... ok
epicsMutexTest.tap ........... ok
epicsSpinTest.tap ............ ok
epicsAtomicTest.tap .......... ok
macDefExpandTest.tap ......... ok
macLibTest.tap ............... ok
taskwdTest.tap ............... ok
blockingSockTest.tap ......... ok
epicsMessageQueueTest.tap .... ok
epicsStackTraceTest.tap ...... ok
ipAddrToAsciiTest.tap ........ ok
All tests successful.
Files=37, Tests=2885,  5 wallclock secs ( 0.63 usr +  0.11 sys =  0.73 CPU)
Result: PASS
make[3]: Leaving directory '<https://jenkins.aps.anl.gov/job/epics-base-3.15-win64-test/ws/src/libCom/test/O.windows-x64'>
make[2]: Leaving directory '<https://jenkins.aps.anl.gov/job/epics-base-3.15-win64-test/ws/src/libCom/test'>
make -C ca/client test-results 
make[2]: Entering directory '<https://jenkins.aps.anl.gov/job/epics-base-3.15-win64-test/ws/src/ca/client'>
make -C O.windows-x64 -f ../Makefile TOP=../../../.. \
    T_A=windows-x64 test-results
make[3]: Entering directory '<https://jenkins.aps.anl.gov/job/epics-base-3.15-win64-test/ws/src/ca/client/O.windows-x64'>
make[3]: Nothing to be done for 'test-results'.
make[3]: Leaving directory '<https://jenkins.aps.anl.gov/job/epics-base-3.15-win64-test/ws/src/ca/client/O.windows-x64'>
make[2]: Leaving directory '<https://jenkins.aps.anl.gov/job/epics-base-3.15-win64-test/ws/src/ca/client'>
make -C ca/client/tools test-results 
make[2]: Entering directory '<https://jenkins.aps.anl.gov/job/epics-base-3.15-win64-test/ws/src/ca/client/tools'>
make -C O.windows-x64 -f ../Makefile TOP=../../../../.. \
    T_A=windows-x64 test-results
make[3]: Entering directory '<https://jenkins.aps.anl.gov/job/epics-base-3.15-win64-test/ws/src/ca/client/tools/O.windows-x64'>
make[3]: Nothing to be done for 'test-results'.
make[3]: Leaving directory '<https://jenkins.aps.anl.gov/job/epics-base-3.15-win64-test/ws/src/ca/client/tools/O.windows-x64'>
make[2]: Leaving directory '<https://jenkins.aps.anl.gov/job/epics-base-3.15-win64-test/ws/src/ca/client/tools'>
make -C ca/legacy/gdd test-results 
make[2]: Entering directory '<https://jenkins.aps.anl.gov/job/epics-base-3.15-win64-test/ws/src/ca/legacy/gdd'>
make -C O.windows-x64 -f ../Makefile TOP=../../../../.. \
    T_A=windows-x64 test-results
make[3]: Entering directory '<https://jenkins.aps.anl.gov/job/epics-base-3.15-win64-test/ws/src/ca/legacy/gdd/O.windows-x64'>
make[3]: Nothing to be done for 'test-results'.
make[3]: Leaving directory '<https://jenkins.aps.anl.gov/job/epics-base-3.15-win64-test/ws/src/ca/legacy/gdd/O.windows-x64'>
make[2]: Leaving directory '<https://jenkins.aps.anl.gov/job/epics-base-3.15-win64-test/ws/src/ca/legacy/gdd'>
make -C ca/legacy/pcas test-results 
make[2]: Entering directory '<https://jenkins.aps.anl.gov/job/epics-base-3.15-win64-test/ws/src/ca/legacy/pcas'>
make -C ./build test-results 
make[3]: Entering directory '<https://jenkins.aps.anl.gov/job/epics-base-3.15-win64-test/ws/src/ca/legacy/pcas/build'>
make -C O.windows-x64 -f ../Makefile TOP=../../../../../.. \
    T_A=windows-x64 test-results
make[4]: Entering directory '<https://jenkins.aps.anl.gov/job/epics-base-3.15-win64-test/ws/src/ca/legacy/pcas/build/O.windows-x64'>
make[4]: Nothing to be done for 'test-results'.
make[4]: Leaving directory '<https://jenkins.aps.anl.gov/job/epics-base-3.15-win64-test/ws/src/ca/legacy/pcas/build/O.windows-x64'>
make[3]: Leaving directory '<https://jenkins.aps.anl.gov/job/epics-base-3.15-win64-test/ws/src/ca/legacy/pcas/build'>
make -C ./example test-results 
make[3]: Entering directory '<https://jenkins.aps.anl.gov/job/epics-base-3.15-win64-test/ws/src/ca/legacy/pcas/example'>
make -C ./directoryService test-results 
make[4]: Entering directory '<https://jenkins.aps.anl.gov/job/epics-base-3.15-win64-test/ws/src/ca/legacy/pcas/example/directoryService'>
make -C O.windows-x64 -f ../Makefile TOP=../../../../../../.. \
    T_A=windows-x64 test-results
make[5]: Entering directory '<https://jenkins.aps.anl.gov/job/epics-base-3.15-win64-test/ws/src/ca/legacy/pcas/example/directoryService/O.windows-x64'>
make[5]: Nothing to be done for 'test-results'.
make[5]: Leaving directory '<https://jenkins.aps.anl.gov/job/epics-base-3.15-win64-test/ws/src/ca/legacy/pcas/example/directoryService/O.windows-x64'>
make[4]: Leaving directory '<https://jenkins.aps.anl.gov/job/epics-base-3.15-win64-test/ws/src/ca/legacy/pcas/example/directoryService'>
make[3]: Leaving directory '<https://jenkins.aps.anl.gov/job/epics-base-3.15-win64-test/ws/src/ca/legacy/pcas/example'>
make[2]: Leaving directory '<https://jenkins.aps.anl.gov/job/epics-base-3.15-win64-test/ws/src/ca/legacy/pcas'>
make -C ./ioc test-results 
make[2]: Entering directory '<https://jenkins.aps.anl.gov/job/epics-base-3.15-win64-test/ws/src/ioc'>
make -C O.windows-x64 -f ../Makefile TOP=../../.. \
    T_A=windows-x64 test-results
make[3]: Entering directory '<https://jenkins.aps.anl.gov/job/epics-base-3.15-win64-test/ws/src/ioc/O.windows-x64'>
make[3]: Nothing to be done for 'test-results'.
make[3]: Leaving directory '<https://jenkins.aps.anl.gov/job/epics-base-3.15-win64-test/ws/src/ioc/O.windows-x64'>
make[2]: Leaving directory '<https://jenkins.aps.anl.gov/job/epics-base-3.15-win64-test/ws/src/ioc'>
make -C ca/legacy/pcas/ex test-results 
make[2]: Entering directory '<https://jenkins.aps.anl.gov/job/epics-base-3.15-win64-test/ws/src/ca/legacy/pcas/ex'>
make -C O.windows-x64 -f ../Makefile TOP=../../../../../.. \
    T_A=windows-x64 test-results
make[3]: Entering directory '<https://jenkins.aps.anl.gov/job/epics-base-3.15-win64-test/ws/src/ca/legacy/pcas/ex/O.windows-x64'>
make[3]: Nothing to be done for 'test-results'.
make[3]: Leaving directory '<https://jenkins.aps.anl.gov/job/epics-base-3.15-win64-test/ws/src/ca/legacy/pcas/ex/O.windows-x64'>
make[2]: Leaving directory '<https://jenkins.aps.anl.gov/job/epics-base-3.15-win64-test/ws/src/ca/legacy/pcas/ex'>
make -C ca/client/perl test-results 
make[2]: Entering directory '<https://jenkins.aps.anl.gov/job/epics-base-3.15-win64-test/ws/src/ca/client/perl'>
make -C O.windows-x64 -f ../Makefile TOP=../../../../.. \
    T_A=windows-x64 test-results
make[3]: Entering directory '<https://jenkins.aps.anl.gov/job/epics-base-3.15-win64-test/ws/src/ca/client/perl/O.windows-x64'>
make[3]: Nothing to be done for 'test-results'.
make[3]: Leaving directory '<https://jenkins.aps.anl.gov/job/epics-base-3.15-win64-test/ws/src/ca/client/perl/O.windows-x64'>
make[2]: Leaving directory '<https://jenkins.aps.anl.gov/job/epics-base-3.15-win64-test/ws/src/ca/client/perl'>
make -C ioc/db/test test-results 
make[2]: Entering directory '<https://jenkins.aps.anl.gov/job/epics-base-3.15-win64-test/ws/src/ioc/db/test'>
make -C O.windows-x64 -f ../Makefile TOP=../../../../.. \
    T_A=windows-x64 test-results
make[3]: Entering directory '<https://jenkins.aps.anl.gov/job/epics-base-3.15-win64-test/ws/src/ioc/db/test/O.windows-x64'>
prove --failures --ext .tap --exec "perl -CSD -MExtUtils::Command -e cat" --color dbShutdownTest.tap dbPutLinkTest.tap dbLockTest.tap testdbConvert.tap callbackTest.tap callbackParallelTest.tap dbStateTest.tap dbCaStatsTest.tap scanIoTest.tap dbChannelTest.tap dbChArrTest.tap chfPluginTest.tap arrShorthandTest.tap recGblCheckDeadbandTest.tap testPutGetTest.tap
dbShutdownTest.tap ........... ok
dbPutLinkTest.tap ............ ok
dbLockTest.tap ............... ok
testdbConvert.tap ............ ok
callbackTest.tap ............. ok
callbackParallelTest.tap ..... ok
dbStateTest.tap .............. ok
dbCaStatsTest.tap ............ ok
scanIoTest.tap ............... ok
dbChannelTest.tap ............ ok
dbChArrTest.tap .............. ok
chfPluginTest.tap ............ ok
arrShorthandTest.tap ......... ok
recGblCheckDeadbandTest.tap .. ok
testPutGetTest.tap ........... ok
All tests successful.
Files=15, Tests=2075,  2 wallclock secs ( 0.33 usr +  0.14 sys =  0.47 CPU)
Result: PASS
make[3]: Leaving directory '<https://jenkins.aps.anl.gov/job/epics-base-3.15-win64-test/ws/src/ioc/db/test/O.windows-x64'>
make[2]: Leaving directory '<https://jenkins.aps.anl.gov/job/epics-base-3.15-win64-test/ws/src/ioc/db/test'>
make -C ioc/dbtemplate/test test-results 
make[2]: Entering directory '<https://jenkins.aps.anl.gov/job/epics-base-3.15-win64-test/ws/src/ioc/dbtemplate/test'>
make -C O.windows-x64 -f ../Makefile TOP=../../../../.. \
    T_A=windows-x64 test-results
make[3]: Entering directory '<https://jenkins.aps.anl.gov/job/epics-base-3.15-win64-test/ws/src/ioc/dbtemplate/test/O.windows-x64'>
prove --failures --ext .tap --exec "perl -CSD -MExtUtils::Command -e cat" --color msi.tap
msi.tap .. 
Failed 9/9 subtests 

Test Summary Report
-------------------
msi.tap (Wstat: 0 Tests: 0 Failed: 0)
  Parse errors: Bad plan.  You planned 9 tests but ran 0.
Files=1, Tests=0,  1 wallclock secs ( 0.06 usr +  0.06 sys =  0.13 CPU)
Result: FAIL
../../../../../configure/RULES_BUILD:351: recipe for target 'test-results' failed
make[3]: *** [test-results] Error 1
make[3]: Leaving directory '<https://jenkins.aps.anl.gov/job/epics-base-3.15-win64-test/ws/src/ioc/dbtemplate/test/O.windows-x64'>
../../../../configure/RULES_ARCHS:58: recipe for target 'test-results.windows-x64' failed
make[2]: *** [test-results.windows-x64] Error 2
make[2]: Leaving directory '<https://jenkins.aps.anl.gov/job/epics-base-3.15-win64-test/ws/src/ioc/dbtemplate/test'>
../configure/RULES_DIRS:84: recipe for target 'ioc/dbtemplate/test.test-results' failed
make[1]: *** [ioc/dbtemplate/test.test-results] Error 2
make[1]: Leaving directory '<https://jenkins.aps.anl.gov/job/epics-base-3.15-win64-test/ws/src'>
configure/RULES_DIRS:84: recipe for target 'src.test-results' failed
make: *** [src.test-results] Error 2

C:\jenkins\win64-1\workspace\epics-base-3.15-win64>exit 2 
Build step 'Execute Windows batch command' marked build as failure

Replies:
Jenkins build is back to normal : epics-base-3.15-win64-test #135 APS Jenkins

Navigate by Date:
Prev: Build failed in Jenkins: epics-base-3.15-sol-test #93 APS Jenkins
Next: Build failed in Jenkins: epics-base-3.15-win32s-test #127 APS Jenkins
Index: 2002  2003  2004  2005  2006  2007  2008  2009  2010  2011  2012  2013  2014  2015  2016  <2017
Navigate by Thread:
Prev: Jenkins build is back to normal : epics-base-3.15-sol-test #94 APS Jenkins
Next: Jenkins build is back to normal : epics-base-3.15-win64-test #135 APS Jenkins
Index: 2002  2003  2004  2005  2006  2007  2008  2009  2010  2011  2012  2013  2014  2015  2016  <2017
ANJ, 22 Jun 2017 Valid HTML 4.01! · Home · News · About · Base · Modules · Extensions · Distributions · Download ·
· EPICS V4 · IRMIS · Talk · Bugs · Documents · Links · Licensing ·