Argonne National Laboratory

Experimental Physics and
Industrial Control System

2002  2003  2004  2005  2006  2007  2008  2009  2010  2011  2012  2013  2014  2015  2016  <2017 Index 2002  2003  2004  2005  2006  2007  2008  2009  2010  2011  2012  2013  2014  2015  2016  <2017
<== Date ==> <== Thread ==>

Subject: Build failed in Jenkins: epics-base-3.15-test #23
From: APS Jenkins <aps-jenkins@anl.gov>
To: core-talk@aps.anl.gov
Date: Thu, 22 Jun 2017 16:54:10 -0500 (CDT)
See <https://jenkins.aps.anl.gov/job/epics-base-3.15-test/23/display/redirect>

------------------------------------------
[...truncated 4.82 KB...]
make[2]: Entering directory `/Jenkins/jenkins/jobs/epics-base-3.15/workspace/src/template/base/O.linux-x86_64'
make[2]: Nothing to be done for `junitfiles'.
make[2]: Leaving directory `/Jenkins/jenkins/jobs/epics-base-3.15/workspace/src/template/base/O.linux-x86_64'
make[1]: Leaving directory `/Jenkins/jenkins/jobs/epics-base-3.15/workspace/src/template/base'
make -C template/ext junitfiles 
make[1]: Entering directory `/Jenkins/jenkins/jobs/epics-base-3.15/workspace/src/template/ext'
make -C O.linux-x86_64 -f ../Makefile TOP=../../../.. \
    T_A=linux-x86_64 junitfiles
make[2]: Entering directory `/Jenkins/jenkins/jobs/epics-base-3.15/workspace/src/template/ext/O.linux-x86_64'
make[2]: Nothing to be done for `junitfiles'.
make[2]: Leaving directory `/Jenkins/jenkins/jobs/epics-base-3.15/workspace/src/template/ext/O.linux-x86_64'
make[1]: Leaving directory `/Jenkins/jenkins/jobs/epics-base-3.15/workspace/src/template/ext'
make -C ./libCom junitfiles 
make[1]: Entering directory `/Jenkins/jenkins/jobs/epics-base-3.15/workspace/src/libCom'
make -C O.linux-x86_64 -f ../Makefile TOP=../../.. \
    T_A=linux-x86_64 junitfiles
make[2]: Entering directory `/Jenkins/jenkins/jobs/epics-base-3.15/workspace/src/libCom/O.linux-x86_64'
make[2]: Nothing to be done for `junitfiles'.
make[2]: Leaving directory `/Jenkins/jenkins/jobs/epics-base-3.15/workspace/src/libCom/O.linux-x86_64'
make[1]: Leaving directory `/Jenkins/jenkins/jobs/epics-base-3.15/workspace/src/libCom'
make -C libCom/RTEMS junitfiles 
make[1]: Entering directory `/Jenkins/jenkins/jobs/epics-base-3.15/workspace/src/libCom/RTEMS'
make -C O.linux-x86_64 -f ../Makefile TOP=../../../.. \
    T_A=linux-x86_64 junitfiles
make[2]: Entering directory `/Jenkins/jenkins/jobs/epics-base-3.15/workspace/src/libCom/RTEMS/O.linux-x86_64'
make[2]: Nothing to be done for `junitfiles'.
make[2]: Leaving directory `/Jenkins/jenkins/jobs/epics-base-3.15/workspace/src/libCom/RTEMS/O.linux-x86_64'
make[1]: Leaving directory `/Jenkins/jenkins/jobs/epics-base-3.15/workspace/src/libCom/RTEMS'
make -C libCom/test junitfiles 
make[1]: Entering directory `/Jenkins/jenkins/jobs/epics-base-3.15/workspace/src/libCom/test'
make -C O.linux-x86_64 -f ../Makefile TOP=../../../.. \
    T_A=linux-x86_64 junitfiles
make[2]: Entering directory `/Jenkins/jenkins/jobs/epics-base-3.15/workspace/src/libCom/test/O.linux-x86_64'
perl -CSD epicsUnitTestTest.t -tap > epicsUnitTestTest.tap
perl -CSD /Jenkins/jenkins/jobs/epics-base-3.15/workspace/bin/linux-x86_64/tap-to-junit-xml.pl --puretap --output epicsUnitTestTest.xml --input epicsUnitTestTest.tap epicsUnitTestTest
perl -CSD epicsTypesTest.t -tap > epicsTypesTest.tap
perl -CSD /Jenkins/jenkins/jobs/epics-base-3.15/workspace/bin/linux-x86_64/tap-to-junit-xml.pl --puretap --output epicsTypesTest.xml --input epicsTypesTest.tap epicsTypesTest
perl -CSD epicsInlineTest.t -tap > epicsInlineTest.tap
perl -CSD /Jenkins/jenkins/jobs/epics-base-3.15/workspace/bin/linux-x86_64/tap-to-junit-xml.pl --puretap --output epicsInlineTest.xml --input epicsInlineTest.tap epicsInlineTest
perl -CSD epicsCalcTest.t -tap > epicsCalcTest.tap
perl -CSD /Jenkins/jenkins/jobs/epics-base-3.15/workspace/bin/linux-x86_64/tap-to-junit-xml.pl --puretap --output epicsCalcTest.xml --input epicsCalcTest.tap epicsCalcTest
perl -CSD epicsAlgorithmTest.t -tap > epicsAlgorithmTest.tap
perl -CSD /Jenkins/jenkins/jobs/epics-base-3.15/workspace/bin/linux-x86_64/tap-to-junit-xml.pl --puretap --output epicsAlgorithmTest.xml --input epicsAlgorithmTest.tap epicsAlgorithmTest
perl -CSD epicsMathTest.t -tap > epicsMathTest.tap
perl -CSD /Jenkins/jenkins/jobs/epics-base-3.15/workspace/bin/linux-x86_64/tap-to-junit-xml.pl --puretap --output epicsMathTest.xml --input epicsMathTest.tap epicsMathTest
perl -CSD epicsMMIOTest.t -tap > epicsMMIOTest.tap
perl -CSD /Jenkins/jenkins/jobs/epics-base-3.15/workspace/bin/linux-x86_64/tap-to-junit-xml.pl --puretap --output epicsMMIOTest.xml --input epicsMMIOTest.tap epicsMMIOTest
perl -CSD epicsEllTest.t -tap > epicsEllTest.tap
perl -CSD /Jenkins/jenkins/jobs/epics-base-3.15/workspace/bin/linux-x86_64/tap-to-junit-xml.pl --puretap --output epicsEllTest.xml --input epicsEllTest.tap epicsEllTest
perl -CSD epicsEnvTest.t -tap > epicsEnvTest.tap
perl -CSD /Jenkins/jenkins/jobs/epics-base-3.15/workspace/bin/linux-x86_64/tap-to-junit-xml.pl --puretap --output epicsEnvTest.xml --input epicsEnvTest.tap epicsEnvTest
perl -CSD epicsErrlogTest.t -tap > epicsErrlogTest.tap
log client: connected to log server at "127.0.0.1:54521"
perl -CSD /Jenkins/jenkins/jobs/epics-base-3.15/workspace/bin/linux-x86_64/tap-to-junit-xml.pl --puretap --output epicsErrlogTest.xml --input epicsErrlogTest.tap epicsErrlogTest
perl -CSD epicsStdioTest.t -tap > epicsStdioTest.tap
perl -CSD /Jenkins/jenkins/jobs/epics-base-3.15/workspace/bin/linux-x86_64/tap-to-junit-xml.pl --puretap --output epicsStdioTest.xml --input epicsStdioTest.tap epicsStdioTest
perl -CSD epicsStdlibTest.t -tap > epicsStdlibTest.tap
perl -CSD /Jenkins/jenkins/jobs/epics-base-3.15/workspace/bin/linux-x86_64/tap-to-junit-xml.pl --puretap --output epicsStdlibTest.xml --input epicsStdlibTest.tap epicsStdlibTest
perl -CSD epicsSockResolveTest.t -tap > epicsSockResolveTest.tap
perl -CSD /Jenkins/jenkins/jobs/epics-base-3.15/workspace/bin/linux-x86_64/tap-to-junit-xml.pl --puretap --output epicsSockResolveTest.xml --input epicsSockResolveTest.tap epicsSockResolveTest
perl -CSD epicsStringTest.t -tap > epicsStringTest.tap
perl -CSD /Jenkins/jenkins/jobs/epics-base-3.15/workspace/bin/linux-x86_64/tap-to-junit-xml.pl --puretap --output epicsStringTest.xml --input epicsStringTest.tap epicsStringTest
perl -CSD epicsTimeTest.t -tap > epicsTimeTest.tap
perl -CSD /Jenkins/jenkins/jobs/epics-base-3.15/workspace/bin/linux-x86_64/tap-to-junit-xml.pl --puretap --output epicsTimeTest.xml --input epicsTimeTest.tap epicsTimeTest
perl -CSD epicsTimeZoneTest.t -tap > epicsTimeZoneTest.tap
perl -CSD /Jenkins/jenkins/jobs/epics-base-3.15/workspace/bin/linux-x86_64/tap-to-junit-xml.pl --puretap --output epicsTimeZoneTest.xml --input epicsTimeZoneTest.tap epicsTimeZoneTest
perl -CSD epicsThreadTest.t -tap > epicsThreadTest.tap
perl -CSD /Jenkins/jenkins/jobs/epics-base-3.15/workspace/bin/linux-x86_64/tap-to-junit-xml.pl --puretap --output epicsThreadTest.xml --input epicsThreadTest.tap epicsThreadTest
perl -CSD epicsThreadOnceTest.t -tap > epicsThreadOnceTest.tap
perl -CSD /Jenkins/jenkins/jobs/epics-base-3.15/workspace/bin/linux-x86_64/tap-to-junit-xml.pl --puretap --output epicsThreadOnceTest.xml --input epicsThreadOnceTest.tap epicsThreadOnceTest
perl -CSD epicsThreadPriorityTest.t -tap > epicsThreadPriorityTest.tap
perl -CSD /Jenkins/jenkins/jobs/epics-base-3.15/workspace/bin/linux-x86_64/tap-to-junit-xml.pl --puretap --output epicsThreadPriorityTest.xml --input epicsThreadPriorityTest.tap epicsThreadPriorityTest
perl -CSD epicsThreadPrivateTest.t -tap > epicsThreadPrivateTest.tap
perl -CSD /Jenkins/jenkins/jobs/epics-base-3.15/workspace/bin/linux-x86_64/tap-to-junit-xml.pl --puretap --output epicsThreadPrivateTest.xml --input epicsThreadPrivateTest.tap epicsThreadPrivateTest
perl -CSD epicsThreadHooksTest.t -tap > epicsThreadHooksTest.tap
perl -CSD /Jenkins/jenkins/jobs/epics-base-3.15/workspace/bin/linux-x86_64/tap-to-junit-xml.pl --puretap --output epicsThreadHooksTest.xml --input epicsThreadHooksTest.tap epicsThreadHooksTest
perl -CSD epicsThreadPoolTest.t -tap > epicsThreadPoolTest.tap
perl -CSD /Jenkins/jenkins/jobs/epics-base-3.15/workspace/bin/linux-x86_64/tap-to-junit-xml.pl --puretap --output epicsThreadPoolTest.xml --input epicsThreadPoolTest.tap epicsThreadPoolTest
perl -CSD epicsExitTest.t -tap > epicsExitTest.tap
perl -CSD /Jenkins/jenkins/jobs/epics-base-3.15/workspace/bin/linux-x86_64/tap-to-junit-xml.pl --puretap --output epicsExitTest.xml --input epicsExitTest.tap epicsExitTest
perl -CSD epicsTimerTest.t -tap > epicsTimerTest.tap
perl -CSD /Jenkins/jenkins/jobs/epics-base-3.15/workspace/bin/linux-x86_64/tap-to-junit-xml.pl --puretap --output epicsTimerTest.xml --input epicsTimerTest.tap epicsTimerTest
perl -CSD ringPointerTest.t -tap > ringPointerTest.tap
epicsThreadSetPriority called by non epics thread
epicsThreadSetPriority called by non epics thread
perl -CSD /Jenkins/jenkins/jobs/epics-base-3.15/workspace/bin/linux-x86_64/tap-to-junit-xml.pl --puretap --output ringPointerTest.xml --input ringPointerTest.tap ringPointerTest
perl -CSD ringBytesTest.t -tap > ringBytesTest.tap
perl -CSD /Jenkins/jenkins/jobs/epics-base-3.15/workspace/bin/linux-x86_64/tap-to-junit-xml.pl --puretap --output ringBytesTest.xml --input ringBytesTest.tap ringBytesTest
perl -CSD epicsEventTest.t -tap > epicsEventTest.tap
perl -CSD /Jenkins/jenkins/jobs/epics-base-3.15/workspace/bin/linux-x86_64/tap-to-junit-xml.pl --puretap --output epicsEventTest.xml --input epicsEventTest.tap epicsEventTest
perl -CSD epicsMutexTest.t -tap > epicsMutexTest.tap
perl -CSD /Jenkins/jenkins/jobs/epics-base-3.15/workspace/bin/linux-x86_64/tap-to-junit-xml.pl --puretap --output epicsMutexTest.xml --input epicsMutexTest.tap epicsMutexTest
perl -CSD epicsSpinTest.t -tap > epicsSpinTest.tap
perl -CSD /Jenkins/jenkins/jobs/epics-base-3.15/workspace/bin/linux-x86_64/tap-to-junit-xml.pl --puretap --output epicsSpinTest.xml --input epicsSpinTest.tap epicsSpinTest
perl -CSD epicsAtomicTest.t -tap > epicsAtomicTest.tap
perl -CSD /Jenkins/jenkins/jobs/epics-base-3.15/workspace/bin/linux-x86_64/tap-to-junit-xml.pl --puretap --output epicsAtomicTest.xml --input epicsAtomicTest.tap epicsAtomicTest
perl -CSD macDefExpandTest.t -tap > macDefExpandTest.tap
perl -CSD /Jenkins/jenkins/jobs/epics-base-3.15/workspace/bin/linux-x86_64/tap-to-junit-xml.pl --puretap --output macDefExpandTest.xml --input macDefExpandTest.tap macDefExpandTest
perl -CSD macLibTest.t -tap > macLibTest.tap
perl -CSD /Jenkins/jenkins/jobs/epics-base-3.15/workspace/bin/linux-x86_64/tap-to-junit-xml.pl --puretap --output macLibTest.xml --input macLibTest.tap macLibTest
perl -CSD taskwdTest.t -tap > taskwdTest.tap
perl -CSD /Jenkins/jenkins/jobs/epics-base-3.15/workspace/bin/linux-x86_64/tap-to-junit-xml.pl --puretap --output taskwdTest.xml --input taskwdTest.tap taskwdTest
perl -CSD blockingSockTest.t -tap > blockingSockTest.tap
perl -CSD /Jenkins/jenkins/jobs/epics-base-3.15/workspace/bin/linux-x86_64/tap-to-junit-xml.pl --puretap --output blockingSockTest.xml --input blockingSockTest.tap blockingSockTest
perl -CSD epicsMessageQueueTest.t -tap > epicsMessageQueueTest.tap
perl -CSD /Jenkins/jenkins/jobs/epics-base-3.15/workspace/bin/linux-x86_64/tap-to-junit-xml.pl --puretap --output epicsMessageQueueTest.xml --input epicsMessageQueueTest.tap epicsMessageQueueTest
perl -CSD epicsStackTraceTest.t -tap > epicsStackTraceTest.tap
perl -CSD /Jenkins/jenkins/jobs/epics-base-3.15/workspace/bin/linux-x86_64/tap-to-junit-xml.pl --puretap --output epicsStackTraceTest.xml --input epicsStackTraceTest.tap epicsStackTraceTest
perl -CSD ipAddrToAsciiTest.t -tap > ipAddrToAsciiTest.tap
perl -CSD /Jenkins/jenkins/jobs/epics-base-3.15/workspace/bin/linux-x86_64/tap-to-junit-xml.pl --puretap --output ipAddrToAsciiTest.xml --input ipAddrToAsciiTest.tap ipAddrToAsciiTest
make[2]: Leaving directory `/Jenkins/jenkins/jobs/epics-base-3.15/workspace/src/libCom/test/O.linux-x86_64'
make[1]: Leaving directory `/Jenkins/jenkins/jobs/epics-base-3.15/workspace/src/libCom/test'
make -C ca/client junitfiles 
make[1]: Entering directory `/Jenkins/jenkins/jobs/epics-base-3.15/workspace/src/ca/client'
make -C O.linux-x86_64 -f ../Makefile TOP=../../../.. \
    T_A=linux-x86_64 junitfiles
make[2]: Entering directory `/Jenkins/jenkins/jobs/epics-base-3.15/workspace/src/ca/client/O.linux-x86_64'
make[2]: Nothing to be done for `junitfiles'.
make[2]: Leaving directory `/Jenkins/jenkins/jobs/epics-base-3.15/workspace/src/ca/client/O.linux-x86_64'
make[1]: Leaving directory `/Jenkins/jenkins/jobs/epics-base-3.15/workspace/src/ca/client'
make -C ca/client/tools junitfiles 
make[1]: Entering directory `/Jenkins/jenkins/jobs/epics-base-3.15/workspace/src/ca/client/tools'
make -C O.linux-x86_64 -f ../Makefile TOP=../../../../.. \
    T_A=linux-x86_64 junitfiles
make[2]: Entering directory `/Jenkins/jenkins/jobs/epics-base-3.15/workspace/src/ca/client/tools/O.linux-x86_64'
make[2]: Nothing to be done for `junitfiles'.
make[2]: Leaving directory `/Jenkins/jenkins/jobs/epics-base-3.15/workspace/src/ca/client/tools/O.linux-x86_64'
make[1]: Leaving directory `/Jenkins/jenkins/jobs/epics-base-3.15/workspace/src/ca/client/tools'
make -C ca/legacy/gdd junitfiles 
make[1]: Entering directory `/Jenkins/jenkins/jobs/epics-base-3.15/workspace/src/ca/legacy/gdd'
make -C O.linux-x86_64 -f ../Makefile TOP=../../../../.. \
    T_A=linux-x86_64 junitfiles
make[2]: Entering directory `/Jenkins/jenkins/jobs/epics-base-3.15/workspace/src/ca/legacy/gdd/O.linux-x86_64'
make[2]: Nothing to be done for `junitfiles'.
make[2]: Leaving directory `/Jenkins/jenkins/jobs/epics-base-3.15/workspace/src/ca/legacy/gdd/O.linux-x86_64'
make[1]: Leaving directory `/Jenkins/jenkins/jobs/epics-base-3.15/workspace/src/ca/legacy/gdd'
make -C ca/legacy/pcas junitfiles 
make[1]: Entering directory `/Jenkins/jenkins/jobs/epics-base-3.15/workspace/src/ca/legacy/pcas'
make -C ./build junitfiles 
make[2]: Entering directory `/Jenkins/jenkins/jobs/epics-base-3.15/workspace/src/ca/legacy/pcas/build'
make -C O.linux-x86_64 -f ../Makefile TOP=../../../../../.. \
    T_A=linux-x86_64 junitfiles
make[3]: Entering directory `/Jenkins/jenkins/jobs/epics-base-3.15/workspace/src/ca/legacy/pcas/build/O.linux-x86_64'
make[3]: Nothing to be done for `junitfiles'.
make[3]: Leaving directory `/Jenkins/jenkins/jobs/epics-base-3.15/workspace/src/ca/legacy/pcas/build/O.linux-x86_64'
make[2]: Leaving directory `/Jenkins/jenkins/jobs/epics-base-3.15/workspace/src/ca/legacy/pcas/build'
make -C ./example junitfiles 
make[2]: Entering directory `/Jenkins/jenkins/jobs/epics-base-3.15/workspace/src/ca/legacy/pcas/example'
make -C ./directoryService junitfiles 
make[3]: Entering directory `/Jenkins/jenkins/jobs/epics-base-3.15/workspace/src/ca/legacy/pcas/example/directoryService'
make -C O.linux-x86_64 -f ../Makefile TOP=../../../../../../.. \
    T_A=linux-x86_64 junitfiles
make[4]: Entering directory `/Jenkins/jenkins/jobs/epics-base-3.15/workspace/src/ca/legacy/pcas/example/directoryService/O.linux-x86_64'
make[4]: Nothing to be done for `junitfiles'.
make[4]: Leaving directory `/Jenkins/jenkins/jobs/epics-base-3.15/workspace/src/ca/legacy/pcas/example/directoryService/O.linux-x86_64'
make[3]: Leaving directory `/Jenkins/jenkins/jobs/epics-base-3.15/workspace/src/ca/legacy/pcas/example/directoryService'
make[2]: Leaving directory `/Jenkins/jenkins/jobs/epics-base-3.15/workspace/src/ca/legacy/pcas/example'
make[1]: Leaving directory `/Jenkins/jenkins/jobs/epics-base-3.15/workspace/src/ca/legacy/pcas'
make -C ./ioc junitfiles 
make[1]: Entering directory `/Jenkins/jenkins/jobs/epics-base-3.15/workspace/src/ioc'
make -C O.linux-x86_64 -f ../Makefile TOP=../../.. \
    T_A=linux-x86_64 junitfiles
make[2]: Entering directory `/Jenkins/jenkins/jobs/epics-base-3.15/workspace/src/ioc/O.linux-x86_64'
make[2]: Nothing to be done for `junitfiles'.
make[2]: Leaving directory `/Jenkins/jenkins/jobs/epics-base-3.15/workspace/src/ioc/O.linux-x86_64'
make[1]: Leaving directory `/Jenkins/jenkins/jobs/epics-base-3.15/workspace/src/ioc'
make -C ca/legacy/pcas/ex junitfiles 
make[1]: Entering directory `/Jenkins/jenkins/jobs/epics-base-3.15/workspace/src/ca/legacy/pcas/ex'
make -C O.linux-x86_64 -f ../Makefile TOP=../../../../../.. \
    T_A=linux-x86_64 junitfiles
make[2]: Entering directory `/Jenkins/jenkins/jobs/epics-base-3.15/workspace/src/ca/legacy/pcas/ex/O.linux-x86_64'
make[2]: Nothing to be done for `junitfiles'.
make[2]: Leaving directory `/Jenkins/jenkins/jobs/epics-base-3.15/workspace/src/ca/legacy/pcas/ex/O.linux-x86_64'
make[1]: Leaving directory `/Jenkins/jenkins/jobs/epics-base-3.15/workspace/src/ca/legacy/pcas/ex'
make -C ca/client/perl junitfiles 
make[1]: Entering directory `/Jenkins/jenkins/jobs/epics-base-3.15/workspace/src/ca/client/perl'
make -C O.linux-x86_64 -f ../Makefile TOP=../../../../.. \
    T_A=linux-x86_64 junitfiles
make[2]: Entering directory `/Jenkins/jenkins/jobs/epics-base-3.15/workspace/src/ca/client/perl/O.linux-x86_64'
make[2]: Nothing to be done for `junitfiles'.
make[2]: Leaving directory `/Jenkins/jenkins/jobs/epics-base-3.15/workspace/src/ca/client/perl/O.linux-x86_64'
make[1]: Leaving directory `/Jenkins/jenkins/jobs/epics-base-3.15/workspace/src/ca/client/perl'
make -C ioc/db/test junitfiles 
make[1]: Entering directory `/Jenkins/jenkins/jobs/epics-base-3.15/workspace/src/ioc/db/test'
make -C O.linux-x86_64 -f ../Makefile TOP=../../../../.. \
    T_A=linux-x86_64 junitfiles
make[2]: Entering directory `/Jenkins/jenkins/jobs/epics-base-3.15/workspace/src/ioc/db/test/O.linux-x86_64'
perl -CSD dbShutdownTest.t -tap > dbShutdownTest.tap
perl -CSD /Jenkins/jenkins/jobs/epics-base-3.15/workspace/bin/linux-x86_64/tap-to-junit-xml.pl --puretap --output dbShutdownTest.xml --input dbShutdownTest.tap dbShutdownTest
perl -CSD dbPutLinkTest.t -tap > dbPutLinkTest.tap
perl -CSD /Jenkins/jenkins/jobs/epics-base-3.15/workspace/bin/linux-x86_64/tap-to-junit-xml.pl --puretap --output dbPutLinkTest.xml --input dbPutLinkTest.tap dbPutLinkTest
perl -CSD dbLockTest.t -tap > dbLockTest.tap
perl -CSD /Jenkins/jenkins/jobs/epics-base-3.15/workspace/bin/linux-x86_64/tap-to-junit-xml.pl --puretap --output dbLockTest.xml --input dbLockTest.tap dbLockTest
perl -CSD testdbConvert.t -tap > testdbConvert.tap
perl -CSD /Jenkins/jenkins/jobs/epics-base-3.15/workspace/bin/linux-x86_64/tap-to-junit-xml.pl --puretap --output testdbConvert.xml --input testdbConvert.tap testdbConvert
perl -CSD callbackTest.t -tap > callbackTest.tap
perl -CSD /Jenkins/jenkins/jobs/epics-base-3.15/workspace/bin/linux-x86_64/tap-to-junit-xml.pl --puretap --output callbackTest.xml --input callbackTest.tap callbackTest
perl -CSD callbackParallelTest.t -tap > callbackParallelTest.tap
perl -CSD /Jenkins/jenkins/jobs/epics-base-3.15/workspace/bin/linux-x86_64/tap-to-junit-xml.pl --puretap --output callbackParallelTest.xml --input callbackParallelTest.tap callbackParallelTest
perl -CSD dbStateTest.t -tap > dbStateTest.tap
perl -CSD /Jenkins/jenkins/jobs/epics-base-3.15/workspace/bin/linux-x86_64/tap-to-junit-xml.pl --puretap --output dbStateTest.xml --input dbStateTest.tap dbStateTest
perl -CSD dbCaStatsTest.t -tap > dbCaStatsTest.tap
perl -CSD /Jenkins/jenkins/jobs/epics-base-3.15/workspace/bin/linux-x86_64/tap-to-junit-xml.pl --puretap --output dbCaStatsTest.xml --input dbCaStatsTest.tap dbCaStatsTest
perl -CSD scanIoTest.t -tap > scanIoTest.tap
Starting iocInit
iocRun: All initialization complete
Starting iocInit
iocRun: All initialization complete
Starting iocInit
iocRun: All initialization complete
perl -CSD /Jenkins/jenkins/jobs/epics-base-3.15/workspace/bin/linux-x86_64/tap-to-junit-xml.pl --puretap --output scanIoTest.xml --input scanIoTest.tap scanIoTest
perl -CSD dbChannelTest.t -tap > dbChannelTest.tap
perl -CSD /Jenkins/jenkins/jobs/epics-base-3.15/workspace/bin/linux-x86_64/tap-to-junit-xml.pl --puretap --output dbChannelTest.xml --input dbChannelTest.tap dbChannelTest
perl -CSD dbChArrTest.t -tap > dbChArrTest.tap
Starting iocInit
Warning: Duplicate EPICS CA Address list entry "10.8.0.255:5065" discarded
iocRun: All initialization complete
perl -CSD /Jenkins/jenkins/jobs/epics-base-3.15/workspace/bin/linux-x86_64/tap-to-junit-xml.pl --puretap --output dbChArrTest.xml --input dbChArrTest.tap dbChArrTest
perl -CSD chfPluginTest.t -tap > chfPluginTest.tap
chfConfigParseStart: plugin pvt alloc failed
perl -CSD /Jenkins/jenkins/jobs/epics-base-3.15/workspace/bin/linux-x86_64/tap-to-junit-xml.pl --puretap --output chfPluginTest.xml --input chfPluginTest.tap chfPluginTest
perl -CSD arrShorthandTest.t -tap > arrShorthandTest.tap
perl -CSD /Jenkins/jenkins/jobs/epics-base-3.15/workspace/bin/linux-x86_64/tap-to-junit-xml.pl --puretap --output arrShorthandTest.xml --input arrShorthandTest.tap arrShorthandTest
perl -CSD recGblCheckDeadbandTest.t -tap > recGblCheckDeadbandTest.tap
perl -CSD /Jenkins/jenkins/jobs/epics-base-3.15/workspace/bin/linux-x86_64/tap-to-junit-xml.pl --puretap --output recGblCheckDeadbandTest.xml --input recGblCheckDeadbandTest.tap recGblCheckDeadbandTest
perl -CSD testPutGetTest.t -tap > testPutGetTest.tap
perl -CSD /Jenkins/jenkins/jobs/epics-base-3.15/workspace/bin/linux-x86_64/tap-to-junit-xml.pl --puretap --output testPutGetTest.xml --input testPutGetTest.tap testPutGetTest
make[2]: Leaving directory `/Jenkins/jenkins/jobs/epics-base-3.15/workspace/src/ioc/db/test/O.linux-x86_64'
make[1]: Leaving directory `/Jenkins/jenkins/jobs/epics-base-3.15/workspace/src/ioc/db/test'
make -C ioc/dbtemplate/test junitfiles 
make[1]: Entering directory `/Jenkins/jenkins/jobs/epics-base-3.15/workspace/src/ioc/dbtemplate/test'
make -C O.linux-x86_64 -f ../Makefile TOP=../../../../.. \
    T_A=linux-x86_64 junitfiles
make[2]: Entering directory `/Jenkins/jenkins/jobs/epics-base-3.15/workspace/src/ioc/dbtemplate/test/O.linux-x86_64'
perl -CSD msi.t -tap > msi.tap
Variable "$msi" is not imported at msi.t line 42.
Global symbol "$msi" requires explicit package name at msi.t line 42.
Global symbol "$args" requires explicit package name at msi.t line 42.
Execution of msi.t aborted due to compilation errors.
make[2]: [msi.tap] Error 255 (ignored)
perl -CSD /Jenkins/jenkins/jobs/epics-base-3.15/workspace/bin/linux-x86_64/tap-to-junit-xml.pl --puretap --output msi.xml --input msi.tap msi
make[2]: *** [msi.xml] Error 86
make[2]: Leaving directory `/Jenkins/jenkins/jobs/epics-base-3.15/workspace/src/ioc/dbtemplate/test/O.linux-x86_64'
make[1]: *** [junitfiles.linux-x86_64] Error 2
make[1]: Leaving directory `/Jenkins/jenkins/jobs/epics-base-3.15/workspace/src/ioc/dbtemplate/test'
make: *** [ioc/dbtemplate/test.junitfiles] Error 2
make: Leaving directory `/Jenkins/jenkins/jobs/epics-base-3.15/workspace/src'
Build step 'Execute shell' marked build as failure
Recording test results

Replies:
Jenkins build is back to normal : epics-base-3.15-test #24 APS Jenkins

Navigate by Date:
Prev: Build failed in Jenkins: epics-base-3.15-mac-test #135 APS Jenkins
Next: Build failed in Jenkins: epics-base-3.15-linux32-test #113 APS Jenkins
Index: 2002  2003  2004  2005  2006  2007  2008  2009  2010  2011  2012  2013  2014  2015  2016  <2017
Navigate by Thread:
Prev: Jenkins build is back to normal : epics-base-3.15-mac-test #136 APS Jenkins
Next: Jenkins build is back to normal : epics-base-3.15-test #24 APS Jenkins
Index: 2002  2003  2004  2005  2006  2007  2008  2009  2010  2011  2012  2013  2014  2015  2016  <2017
ANJ, 22 Jun 2017 Valid HTML 4.01! · Home · News · About · Base · Modules · Extensions · Distributions · Download ·
· EPICS V4 · IRMIS · Talk · Bugs · Documents · Links · Licensing ·