Argonne National Laboratory

Experimental Physics and
Industrial Control System

2002  2003  2004  2005  2006  2007  2008  2009  2010  2011  2012  2013  2014  2015  2016  <2017 Index 2002  2003  2004  2005  2006  2007  2008  2009  2010  2011  2012  2013  2014  2015  2016  <2017
<== Date ==> <== Thread ==>

Subject: Build failed in Jenkins: epics-base-3.15-win64-test #121
From: APS Jenkins <aps-jenkins@anl.gov>
To: core-talk@aps.anl.gov
Date: Thu, 22 Jun 2017 15:22:24 -0500 (CDT)
See <https://jenkins.aps.anl.gov/job/epics-base-3.15-win64-test/121/display/redirect>

------------------------------------------
[...truncated 10.84 KB...]
make[3]: Entering directory '<https://jenkins.aps.anl.gov/job/epics-base-3.15-win64-test/ws/src/ca/legacy/pcas/build/O.windows-x64'>
make[3]: Nothing to be done for 'tapfiles'.
make[3]: Leaving directory '<https://jenkins.aps.anl.gov/job/epics-base-3.15-win64-test/ws/src/ca/legacy/pcas/build/O.windows-x64'>
make[2]: Leaving directory '<https://jenkins.aps.anl.gov/job/epics-base-3.15-win64-test/ws/src/ca/legacy/pcas/build'>
make -C ./example tapfiles 
make[2]: Entering directory '<https://jenkins.aps.anl.gov/job/epics-base-3.15-win64-test/ws/src/ca/legacy/pcas/example'>
make -C ./directoryService tapfiles 
make[3]: Entering directory '<https://jenkins.aps.anl.gov/job/epics-base-3.15-win64-test/ws/src/ca/legacy/pcas/example/directoryService'>
make -C O.windows-x64 -f ../Makefile TOP=../../../../../../.. \
    T_A=windows-x64 tapfiles
make[4]: Entering directory '<https://jenkins.aps.anl.gov/job/epics-base-3.15-win64-test/ws/src/ca/legacy/pcas/example/directoryService/O.windows-x64'>
make[4]: Nothing to be done for 'tapfiles'.
make[4]: Leaving directory '<https://jenkins.aps.anl.gov/job/epics-base-3.15-win64-test/ws/src/ca/legacy/pcas/example/directoryService/O.windows-x64'>
make[3]: Leaving directory '<https://jenkins.aps.anl.gov/job/epics-base-3.15-win64-test/ws/src/ca/legacy/pcas/example/directoryService'>
make[2]: Leaving directory '<https://jenkins.aps.anl.gov/job/epics-base-3.15-win64-test/ws/src/ca/legacy/pcas/example'>
make[1]: Leaving directory '<https://jenkins.aps.anl.gov/job/epics-base-3.15-win64-test/ws/src/ca/legacy/pcas'>
make -C ./ioc tapfiles 
make[1]: Entering directory '<https://jenkins.aps.anl.gov/job/epics-base-3.15-win64-test/ws/src/ioc'>
make -C O.windows-x64 -f ../Makefile TOP=../../.. \
    T_A=windows-x64 tapfiles
make[2]: Entering directory '<https://jenkins.aps.anl.gov/job/epics-base-3.15-win64-test/ws/src/ioc/O.windows-x64'>
make[2]: Nothing to be done for 'tapfiles'.
make[2]: Leaving directory '<https://jenkins.aps.anl.gov/job/epics-base-3.15-win64-test/ws/src/ioc/O.windows-x64'>
make[1]: Leaving directory '<https://jenkins.aps.anl.gov/job/epics-base-3.15-win64-test/ws/src/ioc'>
make -C ca/legacy/pcas/ex tapfiles 
make[1]: Entering directory '<https://jenkins.aps.anl.gov/job/epics-base-3.15-win64-test/ws/src/ca/legacy/pcas/ex'>
make -C O.windows-x64 -f ../Makefile TOP=../../../../../.. \
    T_A=windows-x64 tapfiles
make[2]: Entering directory '<https://jenkins.aps.anl.gov/job/epics-base-3.15-win64-test/ws/src/ca/legacy/pcas/ex/O.windows-x64'>
make[2]: Nothing to be done for 'tapfiles'.
make[2]: Leaving directory '<https://jenkins.aps.anl.gov/job/epics-base-3.15-win64-test/ws/src/ca/legacy/pcas/ex/O.windows-x64'>
make[1]: Leaving directory '<https://jenkins.aps.anl.gov/job/epics-base-3.15-win64-test/ws/src/ca/legacy/pcas/ex'>
make -C ca/client/perl tapfiles 
make[1]: Entering directory '<https://jenkins.aps.anl.gov/job/epics-base-3.15-win64-test/ws/src/ca/client/perl'>
make -C O.windows-x64 -f ../Makefile TOP=../../../../.. \
    T_A=windows-x64 tapfiles
make[2]: Entering directory '<https://jenkins.aps.anl.gov/job/epics-base-3.15-win64-test/ws/src/ca/client/perl/O.windows-x64'>
make[2]: Nothing to be done for 'tapfiles'.
make[2]: Leaving directory '<https://jenkins.aps.anl.gov/job/epics-base-3.15-win64-test/ws/src/ca/client/perl/O.windows-x64'>
make[1]: Leaving directory '<https://jenkins.aps.anl.gov/job/epics-base-3.15-win64-test/ws/src/ca/client/perl'>
make -C ioc/db/test tapfiles 
make[1]: Entering directory '<https://jenkins.aps.anl.gov/job/epics-base-3.15-win64-test/ws/src/ioc/db/test'>
make -C O.windows-x64 -f ../Makefile TOP=../../../../.. \
    T_A=windows-x64 tapfiles
make[2]: Entering directory '<https://jenkins.aps.anl.gov/job/epics-base-3.15-win64-test/ws/src/ioc/db/test/O.windows-x64'>
perl -CSD dbShutdownTest.t -tap > dbShutdownTest.tap
perl -CSD dbPutLinkTest.t -tap > dbPutLinkTest.tap
perl -CSD dbLockTest.t -tap > dbLockTest.tap
perl -CSD testdbConvert.t -tap > testdbConvert.tap
perl -CSD callbackTest.t -tap > callbackTest.tap
perl -CSD callbackParallelTest.t -tap > callbackParallelTest.tap
perl -CSD dbStateTest.t -tap > dbStateTest.tap
perl -CSD dbCaStatsTest.t -tap > dbCaStatsTest.tap
perl -CSD scanIoTest.t -tap > scanIoTest.tap
Starting iocInit
iocRun: All initialization complete
Starting iocInit
iocRun: All initialization complete
Starting iocInit
iocRun: All initialization complete
perl -CSD dbChannelTest.t -tap > dbChannelTest.tap
perl -CSD dbChArrTest.t -tap > dbChArrTest.tap
Starting iocInit
iocRun: All initialization complete
perl -CSD chfPluginTest.t -tap > chfPluginTest.tap
chfConfigParseStart: plugin pvt alloc failed
perl -CSD arrShorthandTest.t -tap > arrShorthandTest.tap
perl -CSD recGblCheckDeadbandTest.t -tap > recGblCheckDeadbandTest.tap
perl -CSD testPutGetTest.t -tap > testPutGetTest.tap
make[2]: Leaving directory '<https://jenkins.aps.anl.gov/job/epics-base-3.15-win64-test/ws/src/ioc/db/test/O.windows-x64'>
make[1]: Leaving directory '<https://jenkins.aps.anl.gov/job/epics-base-3.15-win64-test/ws/src/ioc/db/test'>
make -C ioc/dbtemplate/test tapfiles 
make[1]: Entering directory '<https://jenkins.aps.anl.gov/job/epics-base-3.15-win64-test/ws/src/ioc/dbtemplate/test'>
make -C O.windows-x64 -f ../Makefile TOP=../../../../.. \
    T_A=windows-x64 tapfiles
make[2]: Entering directory '<https://jenkins.aps.anl.gov/job/epics-base-3.15-win64-test/ws/src/ioc/dbtemplate/test/O.windows-x64'>
perl -CSD msi.t -tap > msi.tap
# Test 7 got: "" (msi.t at line 38)
#   Expected: "This is t1-template.txt\n\nWith $(a,undefined) & $(b,undefined):\nThis is t1-include.txt \n  a = default value used when a is undefined\n  b = default value used when b is undefined\nEnd of t1-include.txt\n\nOn defining a=aaa & b=bbb:\nThis is t1-include.txt again\n  a = aaa\n  b = bbb\nEnd of t1-include.txt\n\nOn setting a=\"aa\":\nThis is t1-include.txt again\n  a = \"aa\"\n  b = bbb\nEnd of t1-include.txt\n\nEnd of t1-template.txt\n"
#   Lines 1-1 are missing:
#    - "This is t1-template.txt\n"
#    - "\n"
#    - "With $(a,undefined) & $(b,undefined):\n"
#    - "This is t1-include.txt \n"
#    - "  a = default value used when a is undefined\n"
#    - "  b = default value used when b is undefined\n"
#    - "End of t1-include.txt\n"
#    - "\n"
#    - "On defining a=aaa & b=bbb:\n"
#    - "This is t1-include.txt again\n"
#    - "  a = aaa\n"
#    - "  b = bbb\n"
#    - "End of t1-include.txt\n"
#    - "\n"
#    - "On setting a=\"aa\":\n"
#    - "This is t1-include.txt again\n"
#    - "  a = \"aa\"\n"
#    - "  b = bbb\n"
#    - "End of t1-include.txt\n"
#    - "\n"
#    - "End of t1-template.txt\n"
#  msi.t line 38 is: ok(slurp($out), slurp('../t1-result.txt'));
make[2]: Leaving directory '<https://jenkins.aps.anl.gov/job/epics-base-3.15-win64-test/ws/src/ioc/dbtemplate/test/O.windows-x64'>
make[1]: Leaving directory '<https://jenkins.aps.anl.gov/job/epics-base-3.15-win64-test/ws/src/ioc/dbtemplate/test'>
make -C ./std tapfiles 
make[1]: Entering directory '<https://jenkins.aps.anl.gov/job/epics-base-3.15-win64-test/ws/src/std'>
make -C O.windows-x64 -f ../Makefile TOP=../../.. \
    T_A=windows-x64 tapfiles
make[2]: Entering directory '<https://jenkins.aps.anl.gov/job/epics-base-3.15-win64-test/ws/src/std/O.windows-x64'>
make[2]: Nothing to be done for 'tapfiles'.
make[2]: Leaving directory '<https://jenkins.aps.anl.gov/job/epics-base-3.15-win64-test/ws/src/std/O.windows-x64'>
make[1]: Leaving directory '<https://jenkins.aps.anl.gov/job/epics-base-3.15-win64-test/ws/src/std'>
make -C std/filters/test tapfiles 
make[1]: Entering directory '<https://jenkins.aps.anl.gov/job/epics-base-3.15-win64-test/ws/src/std/filters/test'>
make -C O.windows-x64 -f ../Makefile TOP=../../../../.. \
    T_A=windows-x64 tapfiles
make[2]: Entering directory '<https://jenkins.aps.anl.gov/job/epics-base-3.15-win64-test/ws/src/std/filters/test/O.windows-x64'>
perl -CSD tsTest.t -tap > tsTest.tap
perl -CSD dbndTest.t -tap > dbndTest.tap
perl -CSD arrTest.t -tap > arrTest.tap
perl -CSD syncTest.t -tap > syncTest.tap
make[2]: Leaving directory '<https://jenkins.aps.anl.gov/job/epics-base-3.15-win64-test/ws/src/std/filters/test/O.windows-x64'>
make[1]: Leaving directory '<https://jenkins.aps.anl.gov/job/epics-base-3.15-win64-test/ws/src/std/filters/test'>
make -C std/rec/test tapfiles 
make[1]: Entering directory '<https://jenkins.aps.anl.gov/job/epics-base-3.15-win64-test/ws/src/std/rec/test'>
make -C O.windows-x64 -f ../Makefile TOP=../../../../.. \
    T_A=windows-x64 tapfiles
make[2]: Entering directory '<https://jenkins.aps.anl.gov/job/epics-base-3.15-win64-test/ws/src/std/rec/test/O.windows-x64'>
perl -CSD arrayOpTest.t -tap > arrayOpTest.tap
perl -CSD analogMonitorTest.t -tap > analogMonitorTest.tap
Starting iocInit
perl -CSD regressTest.t -tap > regressTest.tap
make[2]: Leaving directory '<https://jenkins.aps.anl.gov/job/epics-base-3.15-win64-test/ws/src/std/rec/test/O.windows-x64'>
make[1]: Leaving directory '<https://jenkins.aps.anl.gov/job/epics-base-3.15-win64-test/ws/src/std/rec/test'>
make: Leaving directory '<https://jenkins.aps.anl.gov/job/epics-base-3.15-win64-test/ws/src'>

C:\jenkins\win64-1\workspace\epics-base-3.15-win64>make -s test-results 
'cat' is not recognized as an internal or external command,
operable program or batch file.
Breaktable.tap .. 
Dubious, test returned 1 (wstat 256, 0x100)
No subtests run 
'cat' is not recognized as an internal or external command,
operable program or batch file.
DBD.tap ......... 
Dubious, test returned 1 (wstat 256, 0x100)
No subtests run 
'cat' is not recognized as an internal or external command,
operable program or batch file.
Device.tap ...... 
Dubious, test returned 1 (wstat 256, 0x100)
No subtests run 
'cat' is not recognized as an internal or external command,
operable program or batch file.
Driver.tap ...... 
Dubious, test returned 1 (wstat 256, 0x100)
No subtests run 
'cat' is not recognized as an internal or external command,
operable program or batch file.
Function.tap .... 
Dubious, test returned 1 (wstat 256, 0x100)
No subtests run 
'cat' is not recognized as an internal or external command,
operable program or batch file.
macLib.tap ...... 
Dubious, test returned 1 (wstat 256, 0x100)
No subtests run 
'cat' is not recognized as an internal or external command,
operable program or batch file.
Menu.tap ........ 
Dubious, test returned 1 (wstat 256, 0x100)
No subtests run 
'cat' is not recognized as an internal or external command,
operable program or batch file.
Recfield.tap .... 
Dubious, test returned 1 (wstat 256, 0x100)
No subtests run 
'cat' is not recognized as an internal or external command,
operable program or batch file.
Recordtype.tap .. 
Dubious, test returned 1 (wstat 256, 0x100)
No subtests run 
'cat' is not recognized as an internal or external command,
operable program or batch file.
Registrar.tap ... 
Dubious, test returned 1 (wstat 256, 0x100)
No subtests run 
'cat' is not recognized as an internal or external command,
operable program or batch file.
Snippets.tap .... 
Dubious, test returned 1 (wstat 256, 0x100)
No subtests run 
'cat' is not recognized as an internal or external command,
operable program or batch file.
Variable.tap .... 
Dubious, test returned 1 (wstat 256, 0x100)
No subtests run 

Test Summary Report
-------------------
Breaktable.tap (Wstat: 256 Tests: 0 Failed: 0)
  Non-zero exit status: 1
  Parse errors: No plan found in TAP output
DBD.tap       (Wstat: 256 Tests: 0 Failed: 0)
  Non-zero exit status: 1
  Parse errors: No plan found in TAP output
Device.tap    (Wstat: 256 Tests: 0 Failed: 0)
  Non-zero exit status: 1
  Parse errors: No plan found in TAP output
Driver.tap    (Wstat: 256 Tests: 0 Failed: 0)
  Non-zero exit status: 1
  Parse errors: No plan found in TAP output
Function.tap  (Wstat: 256 Tests: 0 Failed: 0)
  Non-zero exit status: 1
  Parse errors: No plan found in TAP output
macLib.tap    (Wstat: 256 Tests: 0 Failed: 0)
  Non-zero exit status: 1
  Parse errors: No plan found in TAP output
Menu.tap      (Wstat: 256 Tests: 0 Failed: 0)
  Non-zero exit status: 1
  Parse errors: No plan found in TAP output
Recfield.tap  (Wstat: 256 Tests: 0 Failed: 0)
  Non-zero exit status: 1
  Parse errors: No plan found in TAP output
Recordtype.tap (Wstat: 256 Tests: 0 Failed: 0)
  Non-zero exit status: 1
  Parse errors: No plan found in TAP output
Registrar.tap (Wstat: 256 Tests: 0 Failed: 0)
  Non-zero exit status: 1
  Parse errors: No plan found in TAP output
Snippets.tap  (Wstat: 256 Tests: 0 Failed: 0)
  Non-zero exit status: 1
  Parse errors: No plan found in TAP output
Variable.tap  (Wstat: 256 Tests: 0 Failed: 0)
  Non-zero exit status: 1
  Parse errors: No plan found in TAP output
Files=12, Tests=0,  1 wallclock secs ( 0.11 usr +  0.09 sys =  0.20 CPU)
Result: FAIL
../../../../configure/RULES_BUILD:351: recipe for target 'test-results' failed
make[3]: *** [test-results] Error 1
../../../configure/RULES_ARCHS:58: recipe for target 'test-results.windows-x64' failed
make[2]: *** [test-results.windows-x64] Error 2
../configure/RULES_DIRS:84: recipe for target 'tools/test.test-results' failed
make[1]: *** [tools/test.test-results] Error 2
configure/RULES_DIRS:84: recipe for target 'src.test-results' failed
make: *** [src.test-results] Error 2

C:\jenkins\win64-1\workspace\epics-base-3.15-win64>exit 2 
Build step 'Execute Windows batch command' marked build as failure

Navigate by Date:
Prev: Jenkins build is back to normal : epics-base-3.15-vx68 #284 APS Jenkins
Next: Build failed in Jenkins: epics-base-3.15-mac-test #135 APS Jenkins
Index: 2002  2003  2004  2005  2006  2007  2008  2009  2010  2011  2012  2013  2014  2015  2016  <2017
Navigate by Thread:
Prev: Jenkins build is back to normal : epics-base-3.15-vx68 #284 APS Jenkins
Next: Build failed in Jenkins: epics-base-3.15-mac-test #135 APS Jenkins
Index: 2002  2003  2004  2005  2006  2007  2008  2009  2010  2011  2012  2013  2014  2015  2016  <2017
ANJ, 22 Jun 2017 Valid HTML 4.01! · Home · News · About · Base · Modules · Extensions · Distributions · Download ·
· EPICS V4 · IRMIS · Talk · Bugs · Documents · Links · Licensing ·