Argonne National Laboratory

Experimental Physics and
Industrial Control System

2002  2003  2004  2005  2006  2007  2008  2009  2010  2011  2012  2013  2014  2015  2016  <2017 Index 2002  2003  2004  2005  2006  2007  2008  2009  2010  2011  2012  2013  2014  2015  2016  <2017
<== Date ==> <== Thread ==>

Subject: Build failed in Jenkins: epics-base-3.14-test #5
From: APS Jenkins <aps-jenkins@anl.gov>
To: core-talk@aps.anl.gov
Date: Thu, 8 Jun 2017 09:30:53 -0500 (CDT)
See <https://jenkins.aps.anl.gov/job/epics-base-3.14-test/5/display/redirect>

------------------------------------------
[...truncated 14.83 KB...]
timerQueueActive: Unexpected C++ exception "epicsEvent::invalidSemaphore()" with type "N10epicsEvent16invalidSemaphoreE" while processing timer queue, at Thu Jun 08 2017 09:27:46.646729556
epicsEvent pthread_cond_timedwait failed: error Invalid argument
timerQueueActive: Unexpected C++ exception "epicsEvent::invalidSemaphore()" with type "N10epicsEvent16invalidSemaphoreE" while processing timer queue, at Thu Jun 08 2017 09:27:56.696337259
epicsEvent pthread_cond_timedwait failed: error Invalid argument
timerQueueActive: Unexpected C++ exception "epicsEvent::invalidSemaphore()" with type "N10epicsEvent16invalidSemaphoreE" while processing timer queue, at Thu Jun 08 2017 09:28:11.699418240
perl ringPointerTest.t -tap > ringPointerTest.tap
perl ringBytesTest.t -tap > ringBytesTest.tap
perl epicsEventTest.t -tap > epicsEventTest.tap
perl epicsMutexTest.t -tap > epicsMutexTest.tap
perl macEnvExpandTest.t -tap > macEnvExpandTest.tap
macLib: macro FOO is undefined (expanding string ${FOO})
macLib: macro FOO is undefined (expanding string ${FOO,BAR})
macLib: macro FOO is undefined (expanding string ${FOO,BAR=baz})
macLib: macro FOO is undefined (expanding string ${FOO,BAR=$(FOO)})
macLib: macro FOO is undefined (expanding string ${FOO,FOO})
macLib: string ${FOO,FOO=$(FOO)} is recursive (expanding macro FOO)
macLib: macro FOO is undefined (expanding string ${FOO,BAR=baz,FUM})
macLib: macro BAZ is undefined (expanding string ${FOO})
macLib: string ${FOO} is recursive (expanding environment variable FOO)
macLib: string ${FOO,FOO=$(FOO)} is recursive (expanding environment variable FOO)
perl macLibTest.t -tap > macLibTest.tap
perl taskwdTest.t -tap > taskwdTest.tap
Thread testTask2 (0x1c58690) suspended
perl blockingSockTest.t -tap > blockingSockTest.tap
perl epicsMessageQueueTest.t -tap > epicsMessageQueueTest.tap
perl ipAddrToAsciiTest.t -tap > ipAddrToAsciiTest.tap
epicsEvent pthread_cond_timedwait failed: error Invalid argument
epicsThread::exitWait(): Unexpected exception  "epicsEvent::invalidSemaphore()"
make[2]: Leaving directory `/Jenkins/jenkins/jobs/epics-base-3.14/workspace/src/libCom/test/O.linux-x86_64'
make[1]: Leaving directory `/Jenkins/jenkins/jobs/epics-base-3.14/workspace/src/libCom/test'
make -C db/test tapfiles 
make[1]: Entering directory `/Jenkins/jenkins/jobs/epics-base-3.14/workspace/src/db/test'
make -C O.linux-x86_64 -f ../Makefile TOP=../../../.. \
    T_A=linux-x86_64 tapfiles
make[2]: Entering directory `/Jenkins/jenkins/jobs/epics-base-3.14/workspace/src/db/test/O.linux-x86_64'
perl callbackTest.t -tap > callbackTest.tap
epicsEvent pthread_cond_timedwait failed: error Invalid argument
timerQueueActive: Unexpected C++ exception "epicsEvent::invalidSemaphore()" with type "N10epicsEvent16invalidSemaphoreE" while processing timer queue, at Thu Jun 08 2017 09:30:34.320851659
epicsEvent pthread_cond_timedwait failed: error Invalid argument
timerQueueActive: Unexpected C++ exception "epicsEvent::invalidSemaphore()" with type "N10epicsEvent16invalidSemaphoreE" while processing timer queue, at Thu Jun 08 2017 09:30:50.317502921
make[2]: Leaving directory `/Jenkins/jenkins/jobs/epics-base-3.14/workspace/src/db/test/O.linux-x86_64'
make[1]: Leaving directory `/Jenkins/jenkins/jobs/epics-base-3.14/workspace/src/db/test'
make -C ./softIoc tapfiles 
make[1]: Entering directory `/Jenkins/jenkins/jobs/epics-base-3.14/workspace/src/softIoc'
make -C O.linux-x86_64 -f ../Makefile TOP=../../.. \
    T_A=linux-x86_64 tapfiles
make[2]: Entering directory `/Jenkins/jenkins/jobs/epics-base-3.14/workspace/src/softIoc/O.linux-x86_64'
make[2]: Nothing to be done for `tapfiles'.
make[2]: Leaving directory `/Jenkins/jenkins/jobs/epics-base-3.14/workspace/src/softIoc/O.linux-x86_64'
make[1]: Leaving directory `/Jenkins/jenkins/jobs/epics-base-3.14/workspace/src/softIoc'
make -C ./gdd tapfiles 
make[1]: Entering directory `/Jenkins/jenkins/jobs/epics-base-3.14/workspace/src/gdd'
make -C O.linux-x86_64 -f ../Makefile TOP=../../.. \
    T_A=linux-x86_64 tapfiles
make[2]: Entering directory `/Jenkins/jenkins/jobs/epics-base-3.14/workspace/src/gdd/O.linux-x86_64'
make[2]: Nothing to be done for `tapfiles'.
make[2]: Leaving directory `/Jenkins/jenkins/jobs/epics-base-3.14/workspace/src/gdd/O.linux-x86_64'
make[1]: Leaving directory `/Jenkins/jenkins/jobs/epics-base-3.14/workspace/src/gdd'
make -C ./cas tapfiles 
make[1]: Entering directory `/Jenkins/jenkins/jobs/epics-base-3.14/workspace/src/cas'
make -C ./build tapfiles 
make[2]: Entering directory `/Jenkins/jenkins/jobs/epics-base-3.14/workspace/src/cas/build'
make -C O.linux-x86_64 -f ../Makefile TOP=../../../.. \
    T_A=linux-x86_64 tapfiles
make[3]: Entering directory `/Jenkins/jenkins/jobs/epics-base-3.14/workspace/src/cas/build/O.linux-x86_64'
make[3]: Nothing to be done for `tapfiles'.
make[3]: Leaving directory `/Jenkins/jenkins/jobs/epics-base-3.14/workspace/src/cas/build/O.linux-x86_64'
make[2]: Leaving directory `/Jenkins/jenkins/jobs/epics-base-3.14/workspace/src/cas/build'
make -C ./example tapfiles 
make[2]: Entering directory `/Jenkins/jenkins/jobs/epics-base-3.14/workspace/src/cas/example'
make -C ./directoryService tapfiles 
make[3]: Entering directory `/Jenkins/jenkins/jobs/epics-base-3.14/workspace/src/cas/example/directoryService'
make -C O.linux-x86_64 -f ../Makefile TOP=../../../../.. \
    T_A=linux-x86_64 tapfiles
make[4]: Entering directory `/Jenkins/jenkins/jobs/epics-base-3.14/workspace/src/cas/example/directoryService/O.linux-x86_64'
make[4]: Nothing to be done for `tapfiles'.
make[4]: Leaving directory `/Jenkins/jenkins/jobs/epics-base-3.14/workspace/src/cas/example/directoryService/O.linux-x86_64'
make[3]: Leaving directory `/Jenkins/jenkins/jobs/epics-base-3.14/workspace/src/cas/example/directoryService'
make[2]: Leaving directory `/Jenkins/jenkins/jobs/epics-base-3.14/workspace/src/cas/example'
make[1]: Leaving directory `/Jenkins/jenkins/jobs/epics-base-3.14/workspace/src/cas'
make -C ./excas tapfiles 
make[1]: Entering directory `/Jenkins/jenkins/jobs/epics-base-3.14/workspace/src/excas'
make -C O.linux-x86_64 -f ../Makefile TOP=../../.. \
    T_A=linux-x86_64 tapfiles
make[2]: Entering directory `/Jenkins/jenkins/jobs/epics-base-3.14/workspace/src/excas/O.linux-x86_64'
make[2]: Nothing to be done for `tapfiles'.
make[2]: Leaving directory `/Jenkins/jenkins/jobs/epics-base-3.14/workspace/src/excas/O.linux-x86_64'
make[1]: Leaving directory `/Jenkins/jenkins/jobs/epics-base-3.14/workspace/src/excas'
make -C ./cap5 tapfiles 
make[1]: Entering directory `/Jenkins/jenkins/jobs/epics-base-3.14/workspace/src/cap5'
make -C O.linux-x86_64 -f ../Makefile TOP=../../.. \
    T_A=linux-x86_64 tapfiles
make[2]: Entering directory `/Jenkins/jenkins/jobs/epics-base-3.14/workspace/src/cap5/O.linux-x86_64'
make[2]: Nothing to be done for `tapfiles'.
make[2]: Leaving directory `/Jenkins/jenkins/jobs/epics-base-3.14/workspace/src/cap5/O.linux-x86_64'
make[1]: Leaving directory `/Jenkins/jenkins/jobs/epics-base-3.14/workspace/src/cap5'
make: Leaving directory `/Jenkins/jenkins/jobs/epics-base-3.14/workspace/src'
+ prove --recurse --color --failures --parse --ext .tap --exec cat src
src/db/test/O.linux-x86_64/callbackTest.tap ................. 
not ok 170 - delay 0.000000 seconds, callback time error 9.000279
not ok 171 - delay 0.250000 seconds, callback time error 8.750234
not ok 172 - delay 0.500000 seconds, callback time error 8.500227
not ok 173 - delay 0.750000 seconds, callback time error 8.250231
not ok 174 - delay 1.000000 seconds, callback time error 8.000228
not ok 175 - delay 1.250000 seconds, callback time error 7.750212
not ok 176 - delay 1.500000 seconds, callback time error 7.500161
not ok 177 - delay 1.750000 seconds, callback time error 7.250161
not ok 178 - delay 2.000000 seconds, callback time error 7.000158
not ok 179 - delay 2.250000 seconds, callback time error 6.750157
not ok 180 - delay 0.000000 seconds, callback time error 9.000300
not ok 181 - delay 0.250000 seconds, callback time error 8.750237
not ok 182 - delay 0.500000 seconds, callback time error 8.500236
not ok 183 - delay 0.750000 seconds, callback time error 8.250236
not ok 184 - delay 1.000000 seconds, callback time error 8.000232
not ok 185 - delay 1.250000 seconds, callback time error 7.750035
not ok 186 - delay 1.500000 seconds, callback time error 7.499995
not ok 187 - delay 2.500000 seconds, callback time error 6.500153
not ok 188 - delay 2.750000 seconds, callback time error 6.250212
not ok 189 - delay 3.000000 seconds, callback time error 6.000212
not ok 190 - delay 3.250000 seconds, callback time error 5.750208
not ok 191 - delay 3.500000 seconds, callback time error 5.500207
not ok 192 - delay 0.000000 seconds, callback time error 9.000293
not ok 193 - delay 0.250000 seconds, callback time error 8.750360
not ok 194 - delay 0.500000 seconds, callback time error 8.500194
not ok 195 - delay 0.750000 seconds, callback time error 8.250203
not ok 196 - delay 1.000000 seconds, callback time error 8.000200
not ok 197 - delay 1.250000 seconds, callback time error 7.750204
not ok 198 - delay 1.500000 seconds, callback time error 7.500200
not ok 199 - delay 1.750000 seconds, callback time error 7.250213
not ok 200 - delay 2.000000 seconds, callback time error 7.000215
not ok 201 - delay 1.750000 seconds, callback time error 7.249990
not ok 202 - delay 2.000000 seconds, callback time error 7.000123
not ok 203 - delay 2.250000 seconds, callback time error 6.750123
not ok 204 - delay 2.500000 seconds, callback time error 6.500119
not ok 205 - delay 2.750000 seconds, callback time error 6.250117
not ok 206 - delay 3.750000 seconds, callback time error 5.250206
not ok 207 - delay 4.000000 seconds, callback time error 5.000336
not ok 208 - delay 4.250000 seconds, callback time error 4.750238
not ok 209 - delay 4.500000 seconds, callback time error 4.499815
not ok 210 - delay 4.750000 seconds, callback time error 4.249789
not ok 211 - delay 2.250000 seconds, callback time error 6.750212
not ok 212 - delay 2.500000 seconds, callback time error 6.500275
not ok 213 - delay 2.750000 seconds, callback time error 6.250238
not ok 214 - delay 3.000000 seconds, callback time error 6.000239
not ok 215 - delay 3.250000 seconds, callback time error 5.750232
not ok 216 - delay 3.500000 seconds, callback time error 5.500233
not ok 217 - delay 3.750000 seconds, callback time error 5.250022
not ok 218 - delay 3.000000 seconds, callback time error 6.000113
not ok 219 - delay 3.250000 seconds, callback time error 5.750184
not ok 220 - delay 3.500000 seconds, callback time error 5.500184
not ok 221 - delay 5.000000 seconds, callback time error 3.999719
not ok 222 - delay 5.250000 seconds, callback time error 3.749778
not ok 223 - delay 5.500000 seconds, callback time error 3.499779
not ok 224 - delay 5.750000 seconds, callback time error 3.249778
not ok 225 - delay 6.000000 seconds, callback time error 2.999779
not ok 226 - delay 6.250000 seconds, callback time error 2.749740
not ok 227 - delay 6.500000 seconds, callback time error 2.499741
not ok 228 - delay 4.000000 seconds, callback time error 5.000016
not ok 229 - delay 4.250000 seconds, callback time error 4.749992
not ok 230 - delay 4.500000 seconds, callback time error 4.499967
not ok 231 - delay 4.750000 seconds, callback time error 4.249925
not ok 232 - delay 5.000000 seconds, callback time error 3.999829
not ok 233 - delay 5.250000 seconds, callback time error 3.749822
not ok 234 - delay 6.750000 seconds, callback time error 2.249740
not ok 235 - delay 3.750000 seconds, callback time error 5.250180
not ok 236 - delay 4.000000 seconds, callback time error 5.000282
not ok 237 - delay 7.000000 seconds, callback time error 1.999779
not ok 238 - delay 7.250000 seconds, callback time error 1.749750
not ok 239 - delay 4.250000 seconds, callback time error 4.750282
not ok 240 - delay 5.500000 seconds, callback time error 3.499822
not ok 241 - delay 5.750000 seconds, callback time error 3.249857
not ok 242 - delay 4.500000 seconds, callback time error 4.500288
not ok 243 - delay 4.750000 seconds, callback time error 4.250300
not ok 244 - delay 7.500000 seconds, callback time error 1.499750
not ok 245 - delay 7.750000 seconds, callback time error 1.249780
not ok 246 - delay 5.000000 seconds, callback time error 4.000300
not ok 247 - delay 6.000000 seconds, callback time error 2.999856
not ok 248 - delay 6.250000 seconds, callback time error 2.749887
not ok 249 - delay 5.250000 seconds, callback time error 3.750306
not ok 250 - delay 5.500000 seconds, callback time error 3.500318
not ok 251 - delay 5.750000 seconds, callback time error 3.250318
not ok 252 - delay 6.500000 seconds, callback time error 2.499852
not ok 253 - delay 6.750000 seconds, callback time error 2.249866
not ok 254 - delay 7.000000 seconds, callback time error 1.999867
not ok 255 - delay 6.000000 seconds, callback time error 3.000315
not ok 256 - delay 6.250000 seconds, callback time error 2.750334
not ok 257 - delay 6.500000 seconds, callback time error 2.500334
not ok 258 - delay 7.250000 seconds, callback time error 1.749865
not ok 259 - delay 7.500000 seconds, callback time error 1.499887
not ok 260 - delay 7.750000 seconds, callback time error 1.249850
not ok 261 - delay 8.000000 seconds, callback time error 0.999853
not ok 262 - delay 8.250000 seconds, callback time error 0.749855
not ok 263 - delay 8.500000 seconds, callback time error 0.499851
not ok 264 - delay 8.000000 seconds, callback time error 0.999781
not ok 265 - delay 6.750000 seconds, callback time error 2.250330
not ok 266 - delay 7.000000 seconds, callback time error 2.000382
not ok 267 - delay 8.250000 seconds, callback time error 0.749900
not ok 268 - delay 8.750000 seconds, callback time error 0.249851
not ok 270 - delay 7.250000 seconds, callback time error 1.750381
not ok 271 - delay 7.500000 seconds, callback time error 1.500406
not ok 272 - delay 7.750000 seconds, callback time error 1.250404
not ok 273 - delay 8.000000 seconds, callback time error 1.000394
not ok 274 - delay 8.250000 seconds, callback time error 0.750382
not ok 275 - delay 8.500000 seconds, callback time error 0.499914
not ok 276 - delay 8.750000 seconds, callback time error 0.249908
not ok 278 - delay 8.500000 seconds, callback time error 0.500378
not ok 279 - delay 8.750000 seconds, callback time error 0.250390
Failed 108/338 subtests 
src/libCom/test/O.linux-x86_64/blockingSockTest.tap ......... ok
src/libCom/test/O.linux-x86_64/epicsAlgorithmTest.tap ....... ok
src/libCom/test/O.linux-x86_64/epicsCalcTest.tap ............ ok
src/libCom/test/O.linux-x86_64/epicsEllTest.tap ............. ok
src/libCom/test/O.linux-x86_64/epicsEnvTest.tap ............. ok
src/libCom/test/O.linux-x86_64/epicsErrlogTest.tap .......... ok
src/libCom/test/O.linux-x86_64/epicsEventTest.tap ........... ok
src/libCom/test/O.linux-x86_64/epicsExitTest.tap ............ ok
src/libCom/test/O.linux-x86_64/epicsMathTest.tap ............ ok
src/libCom/test/O.linux-x86_64/epicsMessageQueueTest.tap .... ok
src/libCom/test/O.linux-x86_64/epicsMutexTest.tap ........... ok
src/libCom/test/O.linux-x86_64/epicsSockResolveTest.tap ..... ok
src/libCom/test/O.linux-x86_64/epicsStdioTest.tap ........... ok
src/libCom/test/O.linux-x86_64/epicsStringTest.tap .......... ok
src/libCom/test/O.linux-x86_64/epicsThreadOnceTest.tap ...... ok
src/libCom/test/O.linux-x86_64/epicsThreadPriorityTest.tap .. ok
src/libCom/test/O.linux-x86_64/epicsThreadPrivateTest.tap ... ok
src/libCom/test/O.linux-x86_64/epicsThreadTest.tap .......... ok
src/libCom/test/O.linux-x86_64/epicsTimeTest.tap ............ ok
src/libCom/test/O.linux-x86_64/epicsTimeZoneTest.tap ........ ok
src/libCom/test/O.linux-x86_64/epicsTimerTest.tap ........... ok
src/libCom/test/O.linux-x86_64/epicsUnitTestTest.tap ........ ok
src/libCom/test/O.linux-x86_64/ipAddrToAsciiTest.tap ........ ok
src/libCom/test/O.linux-x86_64/macEnvExpandTest.tap ......... ok
src/libCom/test/O.linux-x86_64/macLibTest.tap ............... ok
src/libCom/test/O.linux-x86_64/ringBytesTest.tap ............ ok
src/libCom/test/O.linux-x86_64/ringPointerTest.tap .......... ok
src/libCom/test/O.linux-x86_64/taskwdTest.tap ............... ok

Test Summary Report
-------------------
src/db/test/O.linux-x86_64/callbackTest.tap               (Wstat: 0 Tests: 338 Failed: 108)
  Failed tests:  170-268, 270-276, 278-279
Files=29, Tests=2634,  1 wallclock secs ( 0.29 usr  0.02 sys +  0.00 cusr  0.03 csys =  0.34 CPU)
Result: FAIL
Build step 'Execute shell' marked build as failure
TAP Reports Processing: START
Looking for TAP results report in workspace using pattern: src/**/test/O.linux-x86_64/*.tap
Saving reports...
There are failed test cases. Marking build as UNSTABLE
TAP Reports Processing: FINISH

Replies:
Jenkins build is back to normal : epics-base-3.14-test #6 APS Jenkins

Navigate by Date:
Prev: Build failed in Jenkins: epics-base-3.15-sol-test #87 APS Jenkins
Next: Jenkins build became unstable: epics-base-3.14-mac #173 APS Jenkins
Index: 2002  2003  2004  2005  2006  2007  2008  2009  2010  2011  2012  2013  2014  2015  2016  <2017
Navigate by Thread:
Prev: Jenkins build is back to normal : epics-base-3.15-sol-test #89 APS Jenkins
Next: Jenkins build is back to normal : epics-base-3.14-test #6 APS Jenkins
Index: 2002  2003  2004  2005  2006  2007  2008  2009  2010  2011  2012  2013  2014  2015  2016  <2017
ANJ, 14 Jun 2017 Valid HTML 4.01! · Home · News · About · Base · Modules · Extensions · Distributions · Download ·
· EPICS V4 · IRMIS · Talk · Bugs · Documents · Links · Licensing ·