Argonne National Laboratory

Experimental Physics and
Industrial Control System

2002  2003  2004  2005  2006  2007  2008  2009  2010  2011  2012  2013  2014  2015  2016  <2017 Index 2002  2003  2004  2005  2006  2007  2008  2009  2010  2011  2012  2013  2014  2015  2016  <2017
<== Date ==> <== Thread ==>

Subject: Build failed in Jenkins: epics-base-3.15-test #17
From: APS Jenkins <aps-jenkins@anl.gov>
To: core-talk@aps.anl.gov
Date: Thu, 8 Jun 2017 09:15:36 -0500 (CDT)
See <https://jenkins.aps.anl.gov/job/epics-base-3.15-test/17/display/redirect>

------------------------------------------
[...truncated 17.37 KB...]
make[2]: Nothing to be done for `junitfiles'.
make[2]: Leaving directory `/Jenkins/jenkins/jobs/epics-base-3.15/workspace/src/ca/client/tools/O.linux-x86_64'
make[1]: Leaving directory `/Jenkins/jenkins/jobs/epics-base-3.15/workspace/src/ca/client/tools'
make -C ca/legacy/gdd junitfiles 
make[1]: Entering directory `/Jenkins/jenkins/jobs/epics-base-3.15/workspace/src/ca/legacy/gdd'
make -C O.linux-x86_64 -f ../Makefile TOP=../../../../.. \
    T_A=linux-x86_64 junitfiles
make[2]: Entering directory `/Jenkins/jenkins/jobs/epics-base-3.15/workspace/src/ca/legacy/gdd/O.linux-x86_64'
make[2]: Nothing to be done for `junitfiles'.
make[2]: Leaving directory `/Jenkins/jenkins/jobs/epics-base-3.15/workspace/src/ca/legacy/gdd/O.linux-x86_64'
make[1]: Leaving directory `/Jenkins/jenkins/jobs/epics-base-3.15/workspace/src/ca/legacy/gdd'
make -C ca/legacy/pcas junitfiles 
make[1]: Entering directory `/Jenkins/jenkins/jobs/epics-base-3.15/workspace/src/ca/legacy/pcas'
make -C ./build junitfiles 
make[2]: Entering directory `/Jenkins/jenkins/jobs/epics-base-3.15/workspace/src/ca/legacy/pcas/build'
make -C O.linux-x86_64 -f ../Makefile TOP=../../../../../.. \
    T_A=linux-x86_64 junitfiles
make[3]: Entering directory `/Jenkins/jenkins/jobs/epics-base-3.15/workspace/src/ca/legacy/pcas/build/O.linux-x86_64'
make[3]: Nothing to be done for `junitfiles'.
make[3]: Leaving directory `/Jenkins/jenkins/jobs/epics-base-3.15/workspace/src/ca/legacy/pcas/build/O.linux-x86_64'
make[2]: Leaving directory `/Jenkins/jenkins/jobs/epics-base-3.15/workspace/src/ca/legacy/pcas/build'
make -C ./example junitfiles 
make[2]: Entering directory `/Jenkins/jenkins/jobs/epics-base-3.15/workspace/src/ca/legacy/pcas/example'
make -C ./directoryService junitfiles 
make[3]: Entering directory `/Jenkins/jenkins/jobs/epics-base-3.15/workspace/src/ca/legacy/pcas/example/directoryService'
make -C O.linux-x86_64 -f ../Makefile TOP=../../../../../../.. \
    T_A=linux-x86_64 junitfiles
make[4]: Entering directory `/Jenkins/jenkins/jobs/epics-base-3.15/workspace/src/ca/legacy/pcas/example/directoryService/O.linux-x86_64'
make[4]: Nothing to be done for `junitfiles'.
make[4]: Leaving directory `/Jenkins/jenkins/jobs/epics-base-3.15/workspace/src/ca/legacy/pcas/example/directoryService/O.linux-x86_64'
make[3]: Leaving directory `/Jenkins/jenkins/jobs/epics-base-3.15/workspace/src/ca/legacy/pcas/example/directoryService'
make[2]: Leaving directory `/Jenkins/jenkins/jobs/epics-base-3.15/workspace/src/ca/legacy/pcas/example'
make[1]: Leaving directory `/Jenkins/jenkins/jobs/epics-base-3.15/workspace/src/ca/legacy/pcas'
make -C ./ioc junitfiles 
make[1]: Entering directory `/Jenkins/jenkins/jobs/epics-base-3.15/workspace/src/ioc'
make -C O.linux-x86_64 -f ../Makefile TOP=../../.. \
    T_A=linux-x86_64 junitfiles
make[2]: Entering directory `/Jenkins/jenkins/jobs/epics-base-3.15/workspace/src/ioc/O.linux-x86_64'
make[2]: Nothing to be done for `junitfiles'.
make[2]: Leaving directory `/Jenkins/jenkins/jobs/epics-base-3.15/workspace/src/ioc/O.linux-x86_64'
make[1]: Leaving directory `/Jenkins/jenkins/jobs/epics-base-3.15/workspace/src/ioc'
make -C ca/legacy/pcas/ex junitfiles 
make[1]: Entering directory `/Jenkins/jenkins/jobs/epics-base-3.15/workspace/src/ca/legacy/pcas/ex'
make -C O.linux-x86_64 -f ../Makefile TOP=../../../../../.. \
    T_A=linux-x86_64 junitfiles
make[2]: Entering directory `/Jenkins/jenkins/jobs/epics-base-3.15/workspace/src/ca/legacy/pcas/ex/O.linux-x86_64'
make[2]: Nothing to be done for `junitfiles'.
make[2]: Leaving directory `/Jenkins/jenkins/jobs/epics-base-3.15/workspace/src/ca/legacy/pcas/ex/O.linux-x86_64'
make[1]: Leaving directory `/Jenkins/jenkins/jobs/epics-base-3.15/workspace/src/ca/legacy/pcas/ex'
make -C ca/client/perl junitfiles 
make[1]: Entering directory `/Jenkins/jenkins/jobs/epics-base-3.15/workspace/src/ca/client/perl'
make -C O.linux-x86_64 -f ../Makefile TOP=../../../../.. \
    T_A=linux-x86_64 junitfiles
make[2]: Entering directory `/Jenkins/jenkins/jobs/epics-base-3.15/workspace/src/ca/client/perl/O.linux-x86_64'
make[2]: Nothing to be done for `junitfiles'.
make[2]: Leaving directory `/Jenkins/jenkins/jobs/epics-base-3.15/workspace/src/ca/client/perl/O.linux-x86_64'
make[1]: Leaving directory `/Jenkins/jenkins/jobs/epics-base-3.15/workspace/src/ca/client/perl'
make -C ioc/db/test junitfiles 
make[1]: Entering directory `/Jenkins/jenkins/jobs/epics-base-3.15/workspace/src/ioc/db/test'
make -C O.linux-x86_64 -f ../Makefile TOP=../../../../.. \
    T_A=linux-x86_64 junitfiles
make[2]: Entering directory `/Jenkins/jenkins/jobs/epics-base-3.15/workspace/src/ioc/db/test/O.linux-x86_64'
perl -CSD dbShutdownTest.t -tap > dbShutdownTest.tap
perl -CSD /Jenkins/jenkins/jobs/epics-base-3.15/workspace/bin/linux-x86_64/tap-to-junit-xml.pl --puretap --output dbShutdownTest.xml --input dbShutdownTest.tap dbShutdownTest
perl -CSD dbPutLinkTest.t -tap > dbPutLinkTest.tap
perl -CSD /Jenkins/jenkins/jobs/epics-base-3.15/workspace/bin/linux-x86_64/tap-to-junit-xml.pl --puretap --output dbPutLinkTest.xml --input dbPutLinkTest.tap dbPutLinkTest
perl -CSD dbLockTest.t -tap > dbLockTest.tap
perl -CSD /Jenkins/jenkins/jobs/epics-base-3.15/workspace/bin/linux-x86_64/tap-to-junit-xml.pl --puretap --output dbLockTest.xml --input dbLockTest.tap dbLockTest
perl -CSD testdbConvert.t -tap > testdbConvert.tap
perl -CSD /Jenkins/jenkins/jobs/epics-base-3.15/workspace/bin/linux-x86_64/tap-to-junit-xml.pl --puretap --output testdbConvert.xml --input testdbConvert.tap testdbConvert
perl -CSD callbackTest.t -tap > callbackTest.tap
timerQueueActive: Unexpected C++ exception "epicsEvent::invalidSemaphore()" with type "N10epicsEvent16invalidSemaphoreE" while processing timer queue, at Thu Jun 08 2017 09:12:13.330629723
timerQueueActive: Unexpected C++ exception "epicsEvent::invalidSemaphore()" with type "N10epicsEvent16invalidSemaphoreE" while processing timer queue, at Thu Jun 08 2017 09:12:29.326449587
perl -CSD /Jenkins/jenkins/jobs/epics-base-3.15/workspace/bin/linux-x86_64/tap-to-junit-xml.pl --puretap --output callbackTest.xml --input callbackTest.tap callbackTest
perl -CSD callbackParallelTest.t -tap > callbackParallelTest.tap
timerQueueActive: Unexpected C++ exception "epicsEvent::invalidSemaphore()" with type "N10epicsEvent16invalidSemaphoreE" while processing timer queue, at Thu Jun 08 2017 09:12:39.488190310
timerQueueActive: Unexpected C++ exception "epicsEvent::invalidSemaphore()" with type "N10epicsEvent16invalidSemaphoreE" while processing timer queue, at Thu Jun 08 2017 09:12:55.484542401
perl -CSD /Jenkins/jenkins/jobs/epics-base-3.15/workspace/bin/linux-x86_64/tap-to-junit-xml.pl --puretap --output callbackParallelTest.xml --input callbackParallelTest.tap callbackParallelTest
perl -CSD dbStateTest.t -tap > dbStateTest.tap
perl -CSD /Jenkins/jenkins/jobs/epics-base-3.15/workspace/bin/linux-x86_64/tap-to-junit-xml.pl --puretap --output dbStateTest.xml --input dbStateTest.tap dbStateTest
perl -CSD dbCaStatsTest.t -tap > dbCaStatsTest.tap
perl -CSD /Jenkins/jenkins/jobs/epics-base-3.15/workspace/bin/linux-x86_64/tap-to-junit-xml.pl --puretap --output dbCaStatsTest.xml --input dbCaStatsTest.tap dbCaStatsTest
perl -CSD scanIoTest.t -tap > scanIoTest.tap
Starting iocInit
timerQueueActive: Unexpected C++ exception "epicsEvent::invalidSemaphore()" with type "N10epicsEvent16invalidSemaphoreE" while processing timer queue, at Thu Jun 08 2017 09:13:15.963298491
iocRun: All initialization complete
Starting iocInit
timerQueueActive: Unexpected C++ exception "epicsEvent::invalidSemaphore()" with type "N10epicsEvent16invalidSemaphoreE" while processing timer queue, at Thu Jun 08 2017 09:13:26.077087776
iocRun: All initialization complete
Starting iocInit
timerQueueActive: Unexpected C++ exception "epicsEvent::invalidSemaphore()" with type "N10epicsEvent16invalidSemaphoreE" while processing timer queue, at Thu Jun 08 2017 09:13:36.192864449
iocRun: All initialization complete
perl -CSD /Jenkins/jenkins/jobs/epics-base-3.15/workspace/bin/linux-x86_64/tap-to-junit-xml.pl --puretap --output scanIoTest.xml --input scanIoTest.tap scanIoTest
perl -CSD dbChannelTest.t -tap > dbChannelTest.tap
perl -CSD /Jenkins/jenkins/jobs/epics-base-3.15/workspace/bin/linux-x86_64/tap-to-junit-xml.pl --puretap --output dbChannelTest.xml --input dbChannelTest.tap dbChannelTest
perl -CSD dbChArrTest.t -tap > dbChArrTest.tap
Starting iocInit
timerQueueActive: Unexpected C++ exception "epicsEvent::invalidSemaphore()" with type "N10epicsEvent16invalidSemaphoreE" while processing timer queue, at Thu Jun 08 2017 09:13:46.844814285
Warning: Duplicate EPICS CA Address list entry "10.8.0.255:5065" discarded
iocRun: All initialization complete
perl -CSD /Jenkins/jenkins/jobs/epics-base-3.15/workspace/bin/linux-x86_64/tap-to-junit-xml.pl --puretap --output dbChArrTest.xml --input dbChArrTest.tap dbChArrTest
perl -CSD chfPluginTest.t -tap > chfPluginTest.tap
chfConfigParseStart: plugin pvt alloc failed
perl -CSD /Jenkins/jenkins/jobs/epics-base-3.15/workspace/bin/linux-x86_64/tap-to-junit-xml.pl --puretap --output chfPluginTest.xml --input chfPluginTest.tap chfPluginTest
perl -CSD arrShorthandTest.t -tap > arrShorthandTest.tap
perl -CSD /Jenkins/jenkins/jobs/epics-base-3.15/workspace/bin/linux-x86_64/tap-to-junit-xml.pl --puretap --output arrShorthandTest.xml --input arrShorthandTest.tap arrShorthandTest
perl -CSD recGblCheckDeadbandTest.t -tap > recGblCheckDeadbandTest.tap
perl -CSD /Jenkins/jenkins/jobs/epics-base-3.15/workspace/bin/linux-x86_64/tap-to-junit-xml.pl --puretap --output recGblCheckDeadbandTest.xml --input recGblCheckDeadbandTest.tap recGblCheckDeadbandTest
perl -CSD testPutGetTest.t -tap > testPutGetTest.tap
perl -CSD /Jenkins/jenkins/jobs/epics-base-3.15/workspace/bin/linux-x86_64/tap-to-junit-xml.pl --puretap --output testPutGetTest.xml --input testPutGetTest.tap testPutGetTest
make[2]: Leaving directory `/Jenkins/jenkins/jobs/epics-base-3.15/workspace/src/ioc/db/test/O.linux-x86_64'
make[1]: Leaving directory `/Jenkins/jenkins/jobs/epics-base-3.15/workspace/src/ioc/db/test'
make -C ioc/dbtemplate/test junitfiles 
make[1]: Entering directory `/Jenkins/jenkins/jobs/epics-base-3.15/workspace/src/ioc/dbtemplate/test'
make -C O.linux-x86_64 -f ../Makefile TOP=../../../../.. \
    T_A=linux-x86_64 junitfiles
make[2]: Entering directory `/Jenkins/jenkins/jobs/epics-base-3.15/workspace/src/ioc/dbtemplate/test/O.linux-x86_64'
perl -CSD msi.t -tap > msi.tap
perl -CSD /Jenkins/jenkins/jobs/epics-base-3.15/workspace/bin/linux-x86_64/tap-to-junit-xml.pl --puretap --output msi.xml --input msi.tap msi
make[2]: Leaving directory `/Jenkins/jenkins/jobs/epics-base-3.15/workspace/src/ioc/dbtemplate/test/O.linux-x86_64'
make[1]: Leaving directory `/Jenkins/jenkins/jobs/epics-base-3.15/workspace/src/ioc/dbtemplate/test'
make -C ./std junitfiles 
make[1]: Entering directory `/Jenkins/jenkins/jobs/epics-base-3.15/workspace/src/std'
make -C O.linux-x86_64 -f ../Makefile TOP=../../.. \
    T_A=linux-x86_64 junitfiles
make[2]: Entering directory `/Jenkins/jenkins/jobs/epics-base-3.15/workspace/src/std/O.linux-x86_64'
make[2]: Nothing to be done for `junitfiles'.
make[2]: Leaving directory `/Jenkins/jenkins/jobs/epics-base-3.15/workspace/src/std/O.linux-x86_64'
make[1]: Leaving directory `/Jenkins/jenkins/jobs/epics-base-3.15/workspace/src/std'
make -C std/filters/test junitfiles 
make[1]: Entering directory `/Jenkins/jenkins/jobs/epics-base-3.15/workspace/src/std/filters/test'
make -C O.linux-x86_64 -f ../Makefile TOP=../../../../.. \
    T_A=linux-x86_64 junitfiles
make[2]: Entering directory `/Jenkins/jenkins/jobs/epics-base-3.15/workspace/src/std/filters/test/O.linux-x86_64'
perl -CSD tsTest.t -tap > tsTest.tap
perl -CSD /Jenkins/jenkins/jobs/epics-base-3.15/workspace/bin/linux-x86_64/tap-to-junit-xml.pl --puretap --output tsTest.xml --input tsTest.tap tsTest
perl -CSD dbndTest.t -tap > dbndTest.tap
perl -CSD /Jenkins/jenkins/jobs/epics-base-3.15/workspace/bin/linux-x86_64/tap-to-junit-xml.pl --puretap --output dbndTest.xml --input dbndTest.tap dbndTest
perl -CSD arrTest.t -tap > arrTest.tap
perl -CSD /Jenkins/jenkins/jobs/epics-base-3.15/workspace/bin/linux-x86_64/tap-to-junit-xml.pl --puretap --output arrTest.xml --input arrTest.tap arrTest
perl -CSD syncTest.t -tap > syncTest.tap
perl -CSD /Jenkins/jenkins/jobs/epics-base-3.15/workspace/bin/linux-x86_64/tap-to-junit-xml.pl --puretap --output syncTest.xml --input syncTest.tap syncTest
make[2]: Leaving directory `/Jenkins/jenkins/jobs/epics-base-3.15/workspace/src/std/filters/test/O.linux-x86_64'
make[1]: Leaving directory `/Jenkins/jenkins/jobs/epics-base-3.15/workspace/src/std/filters/test'
make -C std/rec/test junitfiles 
make[1]: Entering directory `/Jenkins/jenkins/jobs/epics-base-3.15/workspace/src/std/rec/test'
make -C O.linux-x86_64 -f ../Makefile TOP=../../../../.. \
    T_A=linux-x86_64 junitfiles
make[2]: Entering directory `/Jenkins/jenkins/jobs/epics-base-3.15/workspace/src/std/rec/test/O.linux-x86_64'
perl -CSD arrayOpTest.t -tap > arrayOpTest.tap
perl -CSD /Jenkins/jenkins/jobs/epics-base-3.15/workspace/bin/linux-x86_64/tap-to-junit-xml.pl --puretap --output arrayOpTest.xml --input arrayOpTest.tap arrayOpTest
perl -CSD analogMonitorTest.t -tap > analogMonitorTest.tap
Starting iocInit
timerQueueActive: Unexpected C++ exception "epicsEvent::invalidSemaphore()" with type "N10epicsEvent16invalidSemaphoreE" while processing timer queue, at Thu Jun 08 2017 09:14:50.995035763
perl -CSD /Jenkins/jenkins/jobs/epics-base-3.15/workspace/bin/linux-x86_64/tap-to-junit-xml.pl --puretap --output analogMonitorTest.xml --input analogMonitorTest.tap analogMonitorTest
perl -CSD regressTest.t -tap > regressTest.tap
perl -CSD /Jenkins/jenkins/jobs/epics-base-3.15/workspace/bin/linux-x86_64/tap-to-junit-xml.pl --puretap --output regressTest.xml --input regressTest.tap regressTest
make[2]: Leaving directory `/Jenkins/jenkins/jobs/epics-base-3.15/workspace/src/std/rec/test/O.linux-x86_64'
make[1]: Leaving directory `/Jenkins/jenkins/jobs/epics-base-3.15/workspace/src/std/rec/test'
make: Leaving directory `/Jenkins/jenkins/jobs/epics-base-3.15/workspace/src'
+ make -s -C src test-results
Breaktable.tap .. ok
DBD.tap ......... ok
Device.tap ...... ok
Driver.tap ...... ok
Function.tap .... ok
macLib.tap ...... ok
Menu.tap ........ ok
Recfield.tap .... ok
Recordtype.tap .. ok
Registrar.tap ... ok
Snippets.tap .... ok
Variable.tap .... ok
All tests successful.
Files=12, Tests=224,  0 wallclock secs ( 0.06 usr +  0.01 sys =  0.07 CPU)
Result: PASS
epicsUnitTestTest.tap ........ ok
epicsTypesTest.tap ........... ok
epicsInlineTest.tap .......... ok
epicsCalcTest.tap ............ ok
epicsAlgorithmTest.tap ....... ok
epicsMathTest.tap ............ ok
epicsMMIOTest.tap ............ ok
epicsEllTest.tap ............. ok
epicsEnvTest.tap ............. ok
epicsErrlogTest.tap .......... ok
epicsStdioTest.tap ........... ok
epicsStdlibTest.tap .......... ok
epicsSockResolveTest.tap ..... ok
epicsStringTest.tap .......... ok
epicsTimeTest.tap ............ ok
epicsTimeZoneTest.tap ........ ok
epicsThreadTest.tap .......... ok
epicsThreadOnceTest.tap ...... ok
epicsThreadPriorityTest.tap .. ok
epicsThreadPrivateTest.tap ... ok
epicsThreadHooksTest.tap ..... ok
epicsThreadPoolTest.tap ...... ok
epicsExitTest.tap ............ ok
epicsTimerTest.tap ........... ok
ringPointerTest.tap .......... ok
ringBytesTest.tap ............ ok
epicsEventTest.tap ........... ok
epicsMutexTest.tap ........... ok
epicsSpinTest.tap ............ ok
epicsAtomicTest.tap .......... ok
macDefExpandTest.tap ......... ok
macLibTest.tap ............... ok
taskwdTest.tap ............... ok
blockingSockTest.tap ......... ok
epicsMessageQueueTest.tap .... ok
epicsStackTraceTest.tap ...... ok
ipAddrToAsciiTest.tap ........ ok
All tests successful.
Files=37, Tests=2883,  1 wallclock secs ( 0.33 usr  0.03 sys +  0.00 cusr  0.04 csys =  0.40 CPU)
Result: PASS
dbShutdownTest.tap ........... ok
dbPutLinkTest.tap ............ ok
dbLockTest.tap ............... ok
testdbConvert.tap ............ ok
callbackTest.tap ............. 
not ok  4 - 108 slowups during callbacks
Failed 1/4 subtests 
callbackParallelTest.tap ..... 
not ok  4 - 108 slowups during callbacks
Failed 1/4 subtests 
dbStateTest.tap .............. ok
dbCaStatsTest.tap ............ ok
scanIoTest.tap ............... ok
dbChannelTest.tap ............ ok
dbChArrTest.tap .............. ok
chfPluginTest.tap ............ ok
arrShorthandTest.tap ......... ok
recGblCheckDeadbandTest.tap .. ok
testPutGetTest.tap ........... ok

Test Summary Report
-------------------
callbackTest.tap           (Wstat: 0 Tests: 4 Failed: 1)
  Failed test:  4
callbackParallelTest.tap   (Wstat: 0 Tests: 4 Failed: 1)
  Failed test:  4
Files=15, Tests=2075,  0 wallclock secs ( 0.25 usr  0.01 sys +  0.00 cusr  0.01 csys =  0.27 CPU)
Result: FAIL
make[2]: *** [test-results] Error 1
make[1]: *** [test-results.linux-x86_64] Error 2
make: *** [ioc/db/test.test-results] Error 2
Build step 'Execute shell' marked build as failure
Recording test results

Replies:
Build failed in Jenkins: epics-base-3.15-test #18 APS Jenkins

Navigate by Date:
Prev: Build failed in Jenkins: epics-base-3.15-mac-test #128 APS Jenkins
Next: Build failed in Jenkins: epics-base-3.15-linux32-test #107 APS Jenkins
Index: 2002  2003  2004  2005  2006  2007  2008  2009  2010  2011  2012  2013  2014  2015  2016  <2017
Navigate by Thread:
Prev: Jenkins build is back to normal : epics-base-3.15-mac-test #131 APS Jenkins
Next: Build failed in Jenkins: epics-base-3.15-test #18 APS Jenkins
Index: 2002  2003  2004  2005  2006  2007  2008  2009  2010  2011  2012  2013  2014  2015  2016  <2017
ANJ, 14 Jun 2017 Valid HTML 4.01! · Home · News · About · Base · Modules · Extensions · Distributions · Download ·
· EPICS V4 · IRMIS · Talk · Bugs · Documents · Links · Licensing ·