Argonne National Laboratory

Experimental Physics and
Industrial Control System

2002  2003  2004  2005  2006  2007  2008  2009  2010  2011  2012  2013  2014  2015  2016  <2017 Index 2002  2003  2004  2005  2006  2007  2008  2009  2010  2011  2012  2013  2014  2015  2016  <2017
<== Date ==> <== Thread ==>

Subject: Build failed in Jenkins: epics-base-3.16-test #3
From: APS Jenkins <aps-jenkins@anl.gov>
To: core-talk@aps.anl.gov
Date: Sat, 27 May 2017 21:38:17 -0500 (CDT)
See <https://jenkins.aps.anl.gov/job/epics-base-3.16-test/3/display/redirect>

------------------------------------------
[...truncated 20.97 KB...]
perl -CSD /Jenkins/jenkins/jobs/epics-base-3.16/workspace/bin/linux-x86_64/tap-to-junit-xml.pl --puretap --output dbScanTest.xml --input dbScanTest.tap dbScanTest
perl -CSD dbShutdownTest.t -tap > dbShutdownTest.tap
perl -CSD /Jenkins/jenkins/jobs/epics-base-3.16/workspace/bin/linux-x86_64/tap-to-junit-xml.pl --puretap --output dbShutdownTest.xml --input dbShutdownTest.tap dbShutdownTest
perl -CSD dbPutLinkTest.t -tap > dbPutLinkTest.tap
dbJLinkInit: lexical error: invalid char in json text.
                                  {"x":bbbb}
                     (right here) ------^

perl -CSD /Jenkins/jenkins/jobs/epics-base-3.16/workspace/bin/linux-x86_64/tap-to-junit-xml.pl --puretap --output dbPutLinkTest.xml --input dbPutLinkTest.tap dbPutLinkTest
perl -CSD dbLockTest.t -tap > dbLockTest.tap
perl -CSD /Jenkins/jenkins/jobs/epics-base-3.16/workspace/bin/linux-x86_64/tap-to-junit-xml.pl --puretap --output dbLockTest.xml --input dbLockTest.tap dbLockTest
perl -CSD dbStressTest.t -tap > dbStressTest.tap
perl -CSD /Jenkins/jenkins/jobs/epics-base-3.16/workspace/bin/linux-x86_64/tap-to-junit-xml.pl --puretap --output dbStressTest.xml --input dbStressTest.tap dbStressTest
perl -CSD testdbConvert.t -tap > testdbConvert.tap
perl -CSD /Jenkins/jenkins/jobs/epics-base-3.16/workspace/bin/linux-x86_64/tap-to-junit-xml.pl --puretap --output testdbConvert.xml --input testdbConvert.tap testdbConvert
perl -CSD callbackTest.t -tap > callbackTest.tap
perl -CSD /Jenkins/jenkins/jobs/epics-base-3.16/workspace/bin/linux-x86_64/tap-to-junit-xml.pl --puretap --output callbackTest.xml --input callbackTest.tap callbackTest
perl -CSD callbackParallelTest.t -tap > callbackParallelTest.tap
perl -CSD /Jenkins/jenkins/jobs/epics-base-3.16/workspace/bin/linux-x86_64/tap-to-junit-xml.pl --puretap --output callbackParallelTest.xml --input callbackParallelTest.tap callbackParallelTest
perl -CSD dbStateTest.t -tap > dbStateTest.tap
perl -CSD /Jenkins/jenkins/jobs/epics-base-3.16/workspace/bin/linux-x86_64/tap-to-junit-xml.pl --puretap --output dbStateTest.xml --input dbStateTest.tap dbStateTest
perl -CSD dbCaStatsTest.t -tap > dbCaStatsTest.tap
perl -CSD /Jenkins/jenkins/jobs/epics-base-3.16/workspace/bin/linux-x86_64/tap-to-junit-xml.pl --puretap --output dbCaStatsTest.xml --input dbCaStatsTest.tap dbCaStatsTest
perl -CSD dbCaLinkTest.t -tap > dbCaLinkTest.tap
perl -CSD /Jenkins/jenkins/jobs/epics-base-3.16/workspace/bin/linux-x86_64/tap-to-junit-xml.pl --puretap --output dbCaLinkTest.xml --input dbCaLinkTest.tap dbCaLinkTest
perl -CSD scanIoTest.t -tap > scanIoTest.tap
perl -CSD /Jenkins/jenkins/jobs/epics-base-3.16/workspace/bin/linux-x86_64/tap-to-junit-xml.pl --puretap --output scanIoTest.xml --input scanIoTest.tap scanIoTest
perl -CSD dbChannelTest.t -tap > dbChannelTest.tap
perl -CSD /Jenkins/jenkins/jobs/epics-base-3.16/workspace/bin/linux-x86_64/tap-to-junit-xml.pl --puretap --output dbChannelTest.xml --input dbChannelTest.tap dbChannelTest
perl -CSD dbChArrTest.t -tap > dbChArrTest.tap
Starting iocInit
Warning: Duplicate EPICS CA Address list entry "10.8.0.255:5065" discarded
iocRun: All initialization complete
perl -CSD /Jenkins/jenkins/jobs/epics-base-3.16/workspace/bin/linux-x86_64/tap-to-junit-xml.pl --puretap --output dbChArrTest.xml --input dbChArrTest.tap dbChArrTest
perl -CSD chfPluginTest.t -tap > chfPluginTest.tap
chfConfigParseStart: plugin pvt alloc failed
perl -CSD /Jenkins/jenkins/jobs/epics-base-3.16/workspace/bin/linux-x86_64/tap-to-junit-xml.pl --puretap --output chfPluginTest.xml --input chfPluginTest.tap chfPluginTest
perl -CSD arrShorthandTest.t -tap > arrShorthandTest.tap
perl -CSD /Jenkins/jenkins/jobs/epics-base-3.16/workspace/bin/linux-x86_64/tap-to-junit-xml.pl --puretap --output arrShorthandTest.xml --input arrShorthandTest.tap arrShorthandTest
perl -CSD recGblCheckDeadbandTest.t -tap > recGblCheckDeadbandTest.tap
perl -CSD /Jenkins/jenkins/jobs/epics-base-3.16/workspace/bin/linux-x86_64/tap-to-junit-xml.pl --puretap --output recGblCheckDeadbandTest.xml --input recGblCheckDeadbandTest.tap recGblCheckDeadbandTest
perl -CSD testPutGetTest.t -tap > testPutGetTest.tap
perl -CSD /Jenkins/jenkins/jobs/epics-base-3.16/workspace/bin/linux-x86_64/tap-to-junit-xml.pl --puretap --output testPutGetTest.xml --input testPutGetTest.tap testPutGetTest
perl -CSD dbStaticTest.t -tap > dbStaticTest.tap
perl -CSD /Jenkins/jenkins/jobs/epics-base-3.16/workspace/bin/linux-x86_64/tap-to-junit-xml.pl --puretap --output dbStaticTest.xml --input dbStaticTest.tap dbStaticTest
make[2]: Leaving directory `/Jenkins/jenkins/jobs/epics-base-3.16/workspace/src/ioc/db/test/O.linux-x86_64'
make[1]: Leaving directory `/Jenkins/jenkins/jobs/epics-base-3.16/workspace/src/ioc/db/test'
make -C ioc/dbtemplate/test junitfiles 
make[1]: Entering directory `/Jenkins/jenkins/jobs/epics-base-3.16/workspace/src/ioc/dbtemplate/test'
make -C O.linux-x86_64 -f ../Makefile TOP=../../../../.. \
    T_A=linux-x86_64 junitfiles
make[2]: Entering directory `/Jenkins/jenkins/jobs/epics-base-3.16/workspace/src/ioc/dbtemplate/test/O.linux-x86_64'
perl -CSD msi.t -tap > msi.tap
perl -CSD /Jenkins/jenkins/jobs/epics-base-3.16/workspace/bin/linux-x86_64/tap-to-junit-xml.pl --puretap --output msi.xml --input msi.tap msi
make[2]: Leaving directory `/Jenkins/jenkins/jobs/epics-base-3.16/workspace/src/ioc/dbtemplate/test/O.linux-x86_64'
make[1]: Leaving directory `/Jenkins/jenkins/jobs/epics-base-3.16/workspace/src/ioc/dbtemplate/test'
make -C ./std junitfiles 
make[1]: Entering directory `/Jenkins/jenkins/jobs/epics-base-3.16/workspace/src/std'
make -C O.linux-x86_64 -f ../Makefile TOP=../../.. \
    T_A=linux-x86_64 junitfiles
make[2]: Entering directory `/Jenkins/jenkins/jobs/epics-base-3.16/workspace/src/std/O.linux-x86_64'
make[2]: Nothing to be done for `junitfiles'.
make[2]: Leaving directory `/Jenkins/jenkins/jobs/epics-base-3.16/workspace/src/std/O.linux-x86_64'
make[1]: Leaving directory `/Jenkins/jenkins/jobs/epics-base-3.16/workspace/src/std'
make -C std/filters/test junitfiles 
make[1]: Entering directory `/Jenkins/jenkins/jobs/epics-base-3.16/workspace/src/std/filters/test'
make -C O.linux-x86_64 -f ../Makefile TOP=../../../../.. \
    T_A=linux-x86_64 junitfiles
make[2]: Entering directory `/Jenkins/jenkins/jobs/epics-base-3.16/workspace/src/std/filters/test/O.linux-x86_64'
perl -CSD tsTest.t -tap > tsTest.tap
perl -CSD /Jenkins/jenkins/jobs/epics-base-3.16/workspace/bin/linux-x86_64/tap-to-junit-xml.pl --puretap --output tsTest.xml --input tsTest.tap tsTest
perl -CSD dbndTest.t -tap > dbndTest.tap
perl -CSD /Jenkins/jenkins/jobs/epics-base-3.16/workspace/bin/linux-x86_64/tap-to-junit-xml.pl --puretap --output dbndTest.xml --input dbndTest.tap dbndTest
perl -CSD arrTest.t -tap > arrTest.tap
perl -CSD /Jenkins/jenkins/jobs/epics-base-3.16/workspace/bin/linux-x86_64/tap-to-junit-xml.pl --puretap --output arrTest.xml --input arrTest.tap arrTest
perl -CSD syncTest.t -tap > syncTest.tap
perl -CSD /Jenkins/jenkins/jobs/epics-base-3.16/workspace/bin/linux-x86_64/tap-to-junit-xml.pl --puretap --output syncTest.xml --input syncTest.tap syncTest
make[2]: Leaving directory `/Jenkins/jenkins/jobs/epics-base-3.16/workspace/src/std/filters/test/O.linux-x86_64'
make[1]: Leaving directory `/Jenkins/jenkins/jobs/epics-base-3.16/workspace/src/std/filters/test'
make -C std/rec/test junitfiles 
make[1]: Entering directory `/Jenkins/jenkins/jobs/epics-base-3.16/workspace/src/std/rec/test'
make -C O.linux-x86_64 -f ../Makefile TOP=../../../../.. \
    T_A=linux-x86_64 junitfiles
make[2]: Entering directory `/Jenkins/jenkins/jobs/epics-base-3.16/workspace/src/std/rec/test/O.linux-x86_64'
perl -CSD arrayOpTest.t -tap > arrayOpTest.tap
perl -CSD /Jenkins/jenkins/jobs/epics-base-3.16/workspace/bin/linux-x86_64/tap-to-junit-xml.pl --puretap --output arrayOpTest.xml --input arrayOpTest.tap arrayOpTest
perl -CSD recMiscTest.t -tap > recMiscTest.tap
perl -CSD /Jenkins/jenkins/jobs/epics-base-3.16/workspace/bin/linux-x86_64/tap-to-junit-xml.pl --puretap --output recMiscTest.xml --input recMiscTest.tap recMiscTest
perl -CSD linkRetargetLinkTest.t -tap > linkRetargetLinkTest.tap
perl -CSD /Jenkins/jenkins/jobs/epics-base-3.16/workspace/bin/linux-x86_64/tap-to-junit-xml.pl --puretap --output linkRetargetLinkTest.xml --input linkRetargetLinkTest.tap linkRetargetLinkTest
perl -CSD linkInitTest.t -tap > linkInitTest.tap
perl -CSD /Jenkins/jenkins/jobs/epics-base-3.16/workspace/bin/linux-x86_64/tap-to-junit-xml.pl --puretap --output linkInitTest.xml --input linkInitTest.tap linkInitTest
perl -CSD compressTest.t -tap > compressTest.tap
perl -CSD /Jenkins/jenkins/jobs/epics-base-3.16/workspace/bin/linux-x86_64/tap-to-junit-xml.pl --puretap --output compressTest.xml --input compressTest.tap compressTest
perl -CSD asyncSoftTest.t -tap > asyncSoftTest.tap
*** Error in `./asyncSoftTest': double free or corruption (!prev): 0x000000000187aa00 ***
======= Backtrace: =========
/lib64/libc.so.6(+0x7c503)[0x7f9fd4f8e503]
/Jenkins/jenkins/jobs/epics-base-3.16/workspace/lib/linux-x86_64/libdbRecStd.so.3.16.1(+0x3831e)[0x7f9fd629431e]
/Jenkins/jenkins/jobs/epics-base-3.16/workspace/lib/linux-x86_64/libdbCore.so.3.16.1(+0x5b5a9)[0x7f9fd602a5a9]
/Jenkins/jenkins/jobs/epics-base-3.16/workspace/lib/linux-x86_64/libdbCore.so.3.16.1(iocShutdown+0x61)[0x7f9fd602b031]
/Jenkins/jenkins/jobs/epics-base-3.16/workspace/lib/linux-x86_64/libdbCore.so.3.16.1(testIocShutdownOk+0x46)[0x7f9fd60187e6]
./asyncSoftTest(main+0x5eb)[0x40499b]
/lib64/libc.so.6(__libc_start_main+0xf5)[0x7f9fd4f33b35]
./asyncSoftTest[0x405236]
======= Memory map: ========
00400000-00407000 r-xp 00000000 00:27 1963985085                         /Jenkins/jenkins/jobs/epics-base-3.16/workspace/src/std/rec/test/O.linux-x86_64/asyncSoftTest
00606000-00607000 r--p 00006000 00:27 1963985085                         /Jenkins/jenkins/jobs/epics-base-3.16/workspace/src/std/rec/test/O.linux-x86_64/asyncSoftTest
00607000-00608000 rw-p 00007000 00:27 1963985085                         /Jenkins/jenkins/jobs/epics-base-3.16/workspace/src/std/rec/test/O.linux-x86_64/asyncSoftTest
017b7000-018c3000 rw-p 00000000 00:00 0                                  [heap]
7f9f94000000-7f9f94021000 rw-p 00000000 00:00 0 
7f9f94021000-7f9f98000000 ---p 00000000 00:00 0 
7f9f9c000000-7f9f9c021000 rw-p 00000000 00:00 0 
7f9f9c021000-7f9fa0000000 ---p 00000000 00:00 0 
7f9fa0000000-7f9fa0021000 rw-p 00000000 00:00 0 
7f9fa0021000-7f9fa4000000 ---p 00000000 00:00 0 
7f9fa4000000-7f9fa4021000 rw-p 00000000 00:00 0 
7f9fa4021000-7f9fa8000000 ---p 00000000 00:00 0 
7f9fa8000000-7f9fa8021000 rw-p 00000000 00:00 0 
7f9fa8021000-7f9fac000000 ---p 00000000 00:00 0 
7f9fac000000-7f9fac021000 rw-p 00000000 00:00 0 
7f9fac021000-7f9fb0000000 ---p 00000000 00:00 0 
7f9fb0000000-7f9fb0021000 rw-p 00000000 00:00 0 
7f9fb0021000-7f9fb4000000 ---p 00000000 00:00 0 
7f9fb4000000-7f9fb4021000 rw-p 00000000 00:00 0 
7f9fb4021000-7f9fb8000000 ---p 00000000 00:00 0 
7f9fb8000000-7f9fb8021000 rw-p 00000000 00:00 0 
7f9fb8021000-7f9fbc000000 ---p 00000000 00:00 0 
7f9fbc000000-7f9fbc021000 rw-p 00000000 00:00 0 
7f9fbc021000-7f9fc0000000 ---p 00000000 00:00 0 
7f9fc0000000-7f9fc0029000 rw-p 00000000 00:00 0 
7f9fc0029000-7f9fc4000000 ---p 00000000 00:00 0 
7f9fc4000000-7f9fc4021000 rw-p 00000000 00:00 0 
7f9fc4021000-7f9fc8000000 ---p 00000000 00:00 0 
7f9fc8000000-7f9fc8021000 rw-p 00000000 00:00 0 
7f9fc8021000-7f9fcc000000 ---p 00000000 00:00 0 
7f9fcc000000-7f9fcc021000 rw-p 00000000 00:00 0 
7f9fcc021000-7f9fd0000000 ---p 00000000 00:00 0 
7f9fd226b000-7f9fd226c000 ---p 00000000 00:00 0 
7f9fd226c000-7f9fd236c000 rw-p 00000000 00:00 0 
7f9fd236c000-7f9fd236d000 ---p 00000000 00:00 0 
7f9fd236d000-7f9fd256d000 rw-p 00000000 00:00 0                          [stack:28310]
7f9fd256d000-7f9fd256e000 ---p 00000000 00:00 0 
7f9fd256e000-7f9fd276e000 rw-p 00000000 00:00 0                          [stack:28309]
7f9fd276e000-7f9fd276f000 ---p 00000000 00:00 0 
7f9fd276f000-7f9fd296f000 rw-p 00000000 00:00 0                          [stack:28308]
7f9fd296f000-7f9fd2970000 ---p 00000000 00:00 0 
7f9fd2970000-7f9fd2b70000 rw-p 00000000 00:00 0                          [stack:28307]
7f9fd2b70000-7f9fd2b71000 ---p 00000000 00:00 0 
7f9fd2b71000-7f9fd2d71000 rw-p 00000000 00:00 0                          [stack:28306]
7f9fd2d71000-7f9fd2d72000 ---p 00000000 00:00 0 
7f9fd2d72000-7f9fd2f72000 rw-p 00000000 00:00 0                          [stack:28305]
7f9fd2f72000-7f9fd2f73000 ---p 00000000 00:00 0 
7f9fd2f73000-7f9fd3173000 rw-p 00000000 00:00 0                          [stack:28304]
7f9fd3173000-7f9fd3174000 ---p 00000000 00:00 0 
7f9fd3174000-7f9fd3374000 rw-p 00000000 00:00 0                          [stack:28303]
7f9fd3374000-7f9fd3375000 ---p 00000000 00:00 0 
7f9fd3375000-7f9fd3575000 rw-p 00000000 00:00 0                          [stack:28302]
7f9fd3575000-7f9fd3576000 ---p 00000000 00:00 0 
7f9fd3576000-7f9fd3776000 rw-p 00000000 00:00 0                          [stack:28301]
7f9fd3776000-7f9fd3777000 ---p 00000000 00:00 0 
7f9fd3777000-7f9fd3977000 rw-p 00000000 00:00 0                          [stack:28300]
7f9fd3977000-7f9fd3978000 ---p 00000000 00:00 0 
7f9fd3978000-7f9fd3b78000 rw-p 00000000 00:00 0                          [stack:28299]
7f9fd3b78000-7f9fd3b79000 ---p 00000000 00:00 0 
7f9fd3b79000-7f9fd3c79000 rw-p 00000000 00:00 0                          [stack:28298]
7f9fd3c79000-7f9fd3c7a000 ---p 00000000 00:00 0 
7f9fd3c7a000-7f9fd447a000 rw-p 00000000 00:00 0 
7f9fd447a000-7f9fd449f000 r-xp 00000000 fd:00 100672917                  /usr/lib64/libtinfo.so.5.9
7f9fd449f000-7f9fd469f000 ---p 00025000 fd:00 100672917                  /usr/lib64/libtinfo.so.5.9
7f9fd469f000-7f9fd46a3000 r--p 00025000 fd:00 100672917                  /usr/lib64/libtinfo.so.5.9
7f9fd46a3000-7f9fd46a4000 rw-p 00029000 fd:00 100672917                  /usr/lib64/libtinfo.so.5.9
7f9fd46a4000-7f9fd46a6000 r-xp 00000000 fd:00 100672485                  /usr/lib64/libdl-2.17.so
7f9fd46a6000-7f9fd48a6000 ---p 00002000 fd:00 100672485                  /usr/lib64/libdl-2.17.so
7f9fd48a6000-7f9fd48a7000 r--p 00002000 fd:00 100672485                  /usr/lib64/libdl-2.17.so
7f9fd48a7000-7f9fd48a8000 rw-p 00003000 fd:00 100672485                  /usr/lib64/libdl-2.17.so
7f9fd48a8000-7f9fd48af000 r-xp 00000000 fd:00 100672509                  /usr/lib64/librt-2.17.so
7f9fd48af000-7f9fd4aae000 ---p 00007000 fd:00 100672509                  /usr/lib64/librt-2.17.so
7f9fd4aae000-7f9fd4aaf000 r--p 00006000 fd:00 100672509                  /usr/lib64/librt-2.17.so
7f9fd4aaf000-7f9fd4ab0000 rw-p 00007000 fd:00 100672509                  /usr/lib64/librt-2.17.so
7f9fd4ab0000-7f9fd4aec000 r-xp 00000000 fd:00 100778360                  /usr/lib64/libreadline.so.6.2
7f9fd4aec000-7f9fd4cec000 ---p 0003c000 fd:00 100778360                  /usr/lib64/libreadline.so.6.2
7f9fd4cec000-7f9fd4cee000 r--p 0003c000 fd:00 100778360                  /usr/lib64/libreadline.so.6.2
7f9fd4cee000-7f9fd4cf4000 rw-p 0003e000 fd:00 100778360                  /usr/lib64/libreadline.so.6.2
7f9fd4cf4000-7f9fd4cf6000 rw-p 00000000 00:00 0 
7f9fd4cf6000-7f9fd4d0d000 r-xp 00000000 fd:00 100672505                  /usr/lib64/libpthread-2.17.so
7f9fd4d0d000-7f9fd4f0c000 ---p 00017000 fd:00 100672505                  /usr/lib64/libpthread-2.17.so
7f9fd4f0c000-7f9fd4f0d000 r--p 00016000 fd:00 100672505                  /usr/lib64/libpthread-2.17.so
7f9fd4f0d000-7f9fd4f0e000 rw-p 00017000 fd:00 100672505                  /usr/lib64/libpthread-2.17.so
7f9fd4f0e000-7f9fd4f12000 rw-p 00000000 00:00 0 
7f9fd4f12000-7f9fd50c8000 r-xp 00000000 fd:00 100672479                  /usr/lib64/libc-2.17.so
7f9fd50c8000-7f9fd52c8000 ---p 001b6000 fd:00 100672479                  /usr/lib64/libc-2.17.so
7f9fd52c8000-7f9fd52cc000 r--p 001b6000 fd:00 100672479                  /usr/lib64/libc-2.17.so
7f9fd52cc000-7f9fd52ce000 rw-p 001ba000 fd:00 100672479                  /usr/lib64/libc-2.17.so
7f9fd52ce000-7f9fd52d3000 rw-p 00000000 00:00 0 
7f9fd52d3000-7f9fd52e8000 r-xp 00000000 fd:00 100788836                  /usr/lib64/libgcc_s-4.8.5-20150702.so.1
7f9fd52e8000-7f9fd54e7000 ---p 00015000 fd:00 100788836                  /usr/lib64/libgcc_s-4.8.5-20150702.so.1
7f9fd54e7000-7f9fd54e8000 r--p 00014000 fd:00 100788836                  /usr/lib64/libgcc_s-4.8.5-20150702.so.1
7f9fd54e8000-7f9fd54e9000 rw-p 00015000 fd:00 100788836                  /usr/lib64/libgcc_s-4.8.5-20150702.so.1
7f9fd54e9000-7f9fd55e9000 r-xp 00000000 fd:00 100672487                  /usr/lib64/libm-2.17.so
7f9fd55e9000-7f9fd57e9000 ---p 00100000 fd:00 100672487                  /usr/lib64/libm-2.17.so
7f9fd57e9000-7f9fd57ea000 r--p 00100000 fd:00 100672487                  /usr/lib64/libm-2.17.so
7f9fd57ea000-7f9fd57eb000 rw-p 00101000 fd:00 100672487                  /usr/lib64/libm-2.17.so
7f9fd57eb000-7f9fd58d4000 r-xp 00000000 fd:00 100672866                  /usr/lib64/libstdc++.so.6.0.19
7f9fd58d4000-7f9fd5ad4000 ---p 000e9000 fd:00 100672866                  /usr/lib64/libstdc++.so.6.0.19
7f9fd5ad4000-7f9fd5adc000 r--p 000e9000 fd:00 100672866                  /usr/lib64/libstdc++.so.6.0.19
7f9fd5adc000-7f9fd5ade000 rw-p 000f1000 fd:00 100672866                  /usr/lib64/libstdc++.so.6.0.19
7f9fd5ade000-7f9fd5af3000 rw-p 00000000 00:00 0 
7f9fd5af3000-7f9fd5b5d000 r-xp 00000000 00:27 1963930742                 /Jenkins/jenkins/jobs/epics-base-3.16/workspace/lib/linux-x86_64/libCom.so.3.16.1
7f9fd5b5d000-7f9fd5d5d000 ---p 0006a000 00:27 1963930742                 /Jenkins/jenkins/jobs/epics-base-3.16/workspace/lib/linux-x86_64/libCom.so.3.16.1
7f9fd5d5d000-7f9fd5d60000 r--p 0006a000 00:27 1963930742                 /Jenkins/jenkins/jobs/epics-base-3.16/workspace/lib/linux-x86_64/libCom.so.3.16.1
7f9fd5d60000-7f9fd5d63000 rw-p 0006d000 00:27 1963930742                 /Jenkins/jenkins/jobs/epics-base-3.16/workspace/lib/linux-x86_64/libCom.so.3.16.1
7f9fd5d63000-7f9fd5d65000 rw-p 00000000 00:00 0 
7f9fd5d65000-7f9fd5dca000 r-xp 00000000 00:27 1963930745                 /Jenkins/jenkins/jobs/epics-base-3.16/workspace/lib/linux-x86_64/libca.so.3.16.1
7f9fd5dca000-7f9fd5fc9000 ---p 00065000 00:27 1963930745                 /Jenkins/jenkins/jobs/epics-base-3.16/workspace/lib/linux-x86_64/libca.so.3.16.1
7f9fd5fc9000-7f9fd5fcd000 r--p 00064000 00:27 1963930745                 /Jenkins/jenkins/jobs/epics-base-3.16/workspace/lib/linux-x86_64/libca.so.3.16.1
7f9fd5fcd000-7f9fd5fcf000 rw-p 00068000 00:27 1963930745                 /Jenkins/jenkins/jobs/epics-base-3.16/workspace/lib/linux-x86_64/libca.so.3.16.1
7f9fd5fcf000-7f9fd6052000 r-xp 00000000 00:27 1964683282                 /Jenkins/jenkins/jobs/epics-base-3.16/workspace/lib/linux-x86_64/libdbCore.so.3.16.1
7f9fd6052000-7f9fd6251000 ---p 00083000 00:27 1964683282                 /Jenkins/jenkins/jobs/epics-base-3.16/workspace/lib/linux-x86_64/libdbCore.so.3.16.1
7f9fd6251000-7f9fd6254000 r--p 00082000 00:27 1964683282                 /Jenkins/jenkins/jobs/epics-base-3.16/workspace/lib/linux-x86_64/libdbCore.so.3.16.1
7f9fd6254000-7f9fd6258000 rw-p 00085000 00:27 1964683282                 /Jenkins/jenkins/jobs/epics-base-3.16/workspace/lib/linux-x86_64/libdbCore.so.3.16.1
7f9fd6258000-7f9fd625c000 rw-p 00000000 00:00 0 
7f9fd625c000-7f9fd62a3000 r-xp 00000000 00:27 1963356341                 /Jenkins/jenkins/jobs/epics-base-3.16/workspace/lib/linux-x86_64/libdbRecStd.so.3.16.1
7f9fd62a3000-7f9fd64a3000 ---p 00047000 00:27 1963356341                 /Jenkins/jenkins/jobs/epics-base-3.16/workspace/lib/linux-x86_64/libdbRecStd.so.3.16.1
7f9fd64a3000-7f9fd64a4000 r--p 00047000 00:27 1963356341                 /Jenkins/jenkins/jobs/epics-base-3.16/workspace/lib/linux-x86_64/libdbRecStd.so.3.16.1
7f9fd64a4000-7f9fd64a8000 rw-p 00048000 00:27 1963356341                 /Jenkins/jenkins/jobs/epics-base-3.16/workspace/lib/linux-x86_64/libdbRecStd.so.3.16.1
7f9fd64a8000-7f9fd64c8000 r-xp 00000000 fd:00 100672472                  /usr/lib64/ld-2.17.so
7f9fd6570000-7f9fd6571000 ---p 00000000 00:00 0 
7f9fd6571000-7f9fd65f1000 rw-p 00000000 00:00 0                          [stack:28297]
7f9fd65f1000-7f9fd65f2000 ---p 00000000 00:00 0 
7f9fd65f2000-7f9fd667a000 rw-p 00000000 00:00 0                          [stack:28296]
7f9fd66b4000-7f9fd66c7000 rw-p 00000000 00:00 0 
7f9fd66c7000-7f9fd66c8000 r--p 0001f000 fd:00 100672472                  /usr/lib64/ld-2.17.so
7f9fd66c8000-7f9fd66c9000 rw-p 00020000 fd:00 100672472                  /usr/lib64/ld-2.17.so
7f9fd66c9000-7f9fd66ca000 rw-p 00000000 00:00 0 
7ffe1ce79000-7ffe1ce9a000 rw-p 00000000 00:00 0                          [stack]
7ffe1cf29000-7ffe1cf2b000 r-xp 00000000 00:00 0                          [vdso]
ffffffffff600000-ffffffffff601000 r-xp 00000000 00:00 0                  [vsyscall]
/bin/sh: line 1: 28294 Aborted                 (core dumped) perl -CSD asyncSoftTest.t -tap > asyncSoftTest.tap
make[2]: [asyncSoftTest.tap] Error 134 (ignored)
perl -CSD /Jenkins/jenkins/jobs/epics-base-3.16/workspace/bin/linux-x86_64/tap-to-junit-xml.pl --puretap --output asyncSoftTest.xml --input asyncSoftTest.tap asyncSoftTest
make[2]: *** [asyncSoftTest.xml] Error 86
make[2]: Leaving directory `/Jenkins/jenkins/jobs/epics-base-3.16/workspace/src/std/rec/test/O.linux-x86_64'
make[1]: *** [junitfiles.linux-x86_64] Error 2
make[1]: Leaving directory `/Jenkins/jenkins/jobs/epics-base-3.16/workspace/src/std/rec/test'
make: *** [std/rec/test.junitfiles] Error 2
make: Leaving directory `/Jenkins/jenkins/jobs/epics-base-3.16/workspace/src'
Build step 'Execute shell' marked build as failure
Recording test results

Replies:
Jenkins build is back to normal : epics-base-3.16-test #4 APS Jenkins
References:
Build failed in Jenkins: epics-base-3.16-test #2 APS Jenkins

Navigate by Date:
Prev: Build failed in Jenkins: epics-base-3.16-linux32-test #82 APS Jenkins
Next: Jenkins build is back to normal : epics-base-3.16-vx68 #125 APS Jenkins
Index: 2002  2003  2004  2005  2006  2007  2008  2009  2010  2011  2012  2013  2014  2015  2016  <2017
Navigate by Thread:
Prev: Build failed in Jenkins: epics-base-3.16-test #2 APS Jenkins
Next: Jenkins build is back to normal : epics-base-3.16-test #4 APS Jenkins
Index: 2002  2003  2004  2005  2006  2007  2008  2009  2010  2011  2012  2013  2014  2015  2016  <2017
ANJ, 27 May 2017 Valid HTML 4.01! · Home · News · About · Base · Modules · Extensions · Distributions · Download ·
· EPICS V4 · IRMIS · Talk · Bugs · Documents · Links · Licensing ·