Argonne National Laboratory

Experimental Physics and
Industrial Control System

2002  2003  2004  2005  2006  2007  2008  2009  2010  2011  2012  2013  2014  2015  2016  <2017 Index 2002  2003  2004  2005  2006  2007  2008  2009  2010  2011  2012  2013  2014  2015  2016  <2017
<== Date ==> <== Thread ==>

Subject: Build failed in Jenkins: epics-base-3.16-linux32-test #82
From: APS Jenkins <aps-jenkins@anl.gov>
To: core-talk@aps.anl.gov
Date: Sat, 27 May 2017 21:15:15 -0500 (CDT)
See <https://jenkins.aps.anl.gov/job/epics-base-3.16-linux32-test/82/display/redirect>

------------------------------------------
[...truncated 17.47 KB...]
perl -CSD linkInitTest.t -tap > linkInitTest.tap
perl -CSD compressTest.t -tap > compressTest.tap
perl -CSD asyncSoftTest.t -tap > asyncSoftTest.tap
*** glibc detected *** ./asyncSoftTest: double free or corruption (!prev): 0x08aeaf10 ***
======= Backtrace: =========
/lib/libc.so.6[0x9acbb1]
/lib/libc.so.6[0x9af611]
<https://jenkins.aps.anl.gov/job/epics-base-3.16-linux32-test/ws/lib/linux-x86/libdbRecStd.so.3.16.1(+0x36d18)[0x5ced18]>
<https://jenkins.aps.anl.gov/job/epics-base-3.16-linux32-test/ws/lib/linux-x86/libdbCore.so.3.16.1(+0x54102)[0xbaf102]>
<https://jenkins.aps.anl.gov/job/epics-base-3.16-linux32-test/ws/lib/linux-x86/libdbCore.so.3.16.1(iocShutdown+0x78)[0xbb03d8]>
<https://jenkins.aps.anl.gov/job/epics-base-3.16-linux32-test/ws/lib/linux-x86/libdbCore.so.3.16.1(testIocShutdownOk+0x59)[0xb9f8c9]>
./asyncSoftTest(main+0x43c)[0x804b7cc]
/lib/libc.so.6(__libc_start_main+0xe6)[0x952d26]
./asyncSoftTest[0x804b111]
======= Memory map: ========
0018d000-001c2000 r-xp 00000000 08:02 919411     /lib/libreadline.so.6.0
001c2000-001c6000 rw-p 00035000 08:02 919411     /lib/libreadline.so.6.0
001c6000-001c7000 rw-p 00000000 00:00 0 
00326000-00343000 r-xp 00000000 08:02 918662     /lib/libgcc_s-4.4.7-20120601.so.1
00343000-00344000 rw-p 0001d000 08:02 918662     /lib/libgcc_s-4.4.7-20120601.so.1
0034c000-0042d000 r-xp 00000000 08:02 138670     /usr/lib/libstdc++.so.6.0.13
0042d000-00431000 r--p 000e0000 08:02 138670     /usr/lib/libstdc++.so.6.0.13
00431000-00433000 rw-p 000e4000 08:02 138670     /usr/lib/libstdc++.so.6.0.13
00433000-00439000 rw-p 00000000 00:00 0 
004ce000-004cf000 r-xp 00000000 00:00 0          [vdso]
004f9000-00552000 r-xp 00000000 08:05 1578812    <https://jenkins.aps.anl.gov/job/epics-base-3.16-linux32-test/ws/lib/linux-x86/libca.so.3.16.1>
00552000-00555000 rw-p 00059000 08:05 1578812    <https://jenkins.aps.anl.gov/job/epics-base-3.16-linux32-test/ws/lib/linux-x86/libca.so.3.16.1>
00598000-005d7000 r-xp 00000000 08:05 1579856    <https://jenkins.aps.anl.gov/job/epics-base-3.16-linux32-test/ws/lib/linux-x86/libdbRecStd.so.3.16.1>
005d7000-005da000 rw-p 0003f000 08:05 1579856    <https://jenkins.aps.anl.gov/job/epics-base-3.16-linux32-test/ws/lib/linux-x86/libdbRecStd.so.3.16.1>
0091a000-00938000 r-xp 00000000 08:02 918659     /lib/ld-2.12.so
00938000-00939000 r--p 0001e000 08:02 918659     /lib/ld-2.12.so
00939000-0093a000 rw-p 0001f000 08:02 918659     /lib/ld-2.12.so
0093c000-00acd000 r-xp 00000000 08:02 918660     /lib/libc-2.12.so
00acd000-00acf000 r--p 00191000 08:02 918660     /lib/libc-2.12.so
00acf000-00ad0000 rw-p 00193000 08:02 918660     /lib/libc-2.12.so
00ad0000-00ad3000 rw-p 00000000 00:00 0 
00ad5000-00afd000 r-xp 00000000 08:02 918663     /lib/libm-2.12.so
00afd000-00afe000 r--p 00027000 08:02 918663     /lib/libm-2.12.so
00afe000-00aff000 rw-p 00028000 08:02 918663     /lib/libm-2.12.so
00b01000-00b18000 r-xp 00000000 08:02 918670     /lib/libpthread-2.12.so
00b18000-00b19000 r--p 00016000 08:02 918670     /lib/libpthread-2.12.so
00b19000-00b1a000 rw-p 00017000 08:02 918670     /lib/libpthread-2.12.so
00b1a000-00b1c000 rw-p 00000000 00:00 0 
00b1e000-00b21000 r-xp 00000000 08:02 918671     /lib/libdl-2.12.so
00b21000-00b22000 r--p 00002000 08:02 918671     /lib/libdl-2.12.so
00b22000-00b23000 rw-p 00003000 08:02 918671     /lib/libdl-2.12.so
00b3b000-00b42000 r-xp 00000000 08:02 918674     /lib/librt-2.12.so
00b42000-00b43000 r--p 00006000 08:02 918674     /lib/librt-2.12.so
00b43000-00b44000 rw-p 00007000 08:02 918674     /lib/librt-2.12.so
00b5b000-00bc9000 r-xp 00000000 08:05 1579290    <https://jenkins.aps.anl.gov/job/epics-base-3.16-linux32-test/ws/lib/linux-x86/libdbCore.so.3.16.1>
00bc9000-00bcd000 rw-p 0006d000 08:05 1579290    <https://jenkins.aps.anl.gov/job/epics-base-3.16-linux32-test/ws/lib/linux-x86/libdbCore.so.3.16.1>
00bcd000-00bcf000 rw-p 00000000 00:00 0 
00e07000-00e65000 r-xp 00000000 08:05 1578510    <https://jenkins.aps.anl.gov/job/epics-base-3.16-linux32-test/ws/lib/linux-x86/libCom.so.3.16.1>
00e65000-00e68000 rw-p 0005e000 08:05 1578510    <https://jenkins.aps.anl.gov/job/epics-base-3.16-linux32-test/ws/lib/linux-x86/libCom.so.3.16.1>
00e68000-00e6a000 rw-p 00000000 00:00 0 
0488d000-048a3000 r-xp 00000000 08:02 918750     /lib/libtinfo.so.5.7
048a3000-048a6000 rw-p 00015000 08:02 918750     /lib/libtinfo.so.5.7
08048000-0804d000 r-xp 00000000 08:05 1579924    <https://jenkins.aps.anl.gov/job/epics-base-3.16-linux32-test/ws/src/std/rec/test/O.linux-x86/asyncSoftTest>
0804d000-0804e000 rw-p 00005000 08:05 1579924    <https://jenkins.aps.anl.gov/job/epics-base-3.16-linux32-test/ws/src/std/rec/test/O.linux-x86/asyncSoftTest>
08a79000-08b1e000 rw-p 00000000 00:00 0          [heap]
b5af6000-b5af7000 ---p 00000000 00:00 0 
b5af7000-b5bf7000 rw-p 00000000 00:00 0 
b5bf7000-b5bf8000 ---p 00000000 00:00 0 
b5bf8000-b5cf8000 rw-p 00000000 00:00 0 
b5cf8000-b5cf9000 ---p 00000000 00:00 0 
b5cf9000-b5df9000 rw-p 00000000 00:00 0 
b5df9000-b5dfa000 ---p 00000000 00:00 0 
b5dfa000-b5efa000 rw-p 00000000 00:00 0 
b5efa000-b5efb000 ---p 00000000 00:00 0 
b5efb000-b5ffb000 rw-p 00000000 00:00 0 
b5ffb000-b5ffc000 ---p 00000000 00:00 0 
b5ffc000-b60fc000 rw-p 00000000 00:00 0 
b60fc000-b60fd000 ---p 00000000 00:00 0 
b60fd000-b61fd000 rw-p 00000000 00:00 0 
b61fd000-b61fe000 ---p 00000000 00:00 0 
b61fe000-b62fe000 rw-p 00000000 00:00 0 
b62fe000-b62ff000 ---p 00000000 00:00 0 
b62ff000-b63ff000 rw-p 00000000 00:00 0 
b63ff000-b6400000 ---p 00000000 00:00 0 
b6400000-b6500000 rw-p 00000000 00:00 0 
b6500000-b6521000 rw-p 00000000 00:00 0 
b6521000-b6600000 ---p 00000000 00:00 0 
b6700000-b6721000 rw-p 00000000 00:00 0 
b6721000-b6800000 ---p 00000000 00:00 0 
b68ff000-b6900000 ---p 00000000 00:00 0 
b6900000-b6a00000 rw-p 00000000 00:00 0 
b6a00000-b6a21000 rw-p 00000000 00:00 0 
b6a21000-b6b00000 ---p 00000000 00:00 0 
b6b24000-b6b25000 ---p 00000000 00:00 0 
b6b25000-b6ba5000 rw-p 00000000 00:00 0 
b6ba5000-b6ba6000 ---p 00000000 00:00 0 
b6ba6000-b6ca6000 rw-p 00000000 00:00 0 
b6ca6000-b6ca7000 ---p 00000000 00:00 0 
b6ca7000-b6d27000 rw-p 00000000 00:00 0 
b6d27000-b6d28000 ---p 00000000 00:00 0 
b6d28000-b6d68000 rw-p 00000000 00:00 0 
b6d68000-b6d69000 ---p 00000000 00:00 0 
b6d69000-b6da9000 rw-p 00000000 00:00 0 
b6da9000-b6daa000 ---p 00000000 00:00 0 
b6daa000-b77ae000 rw-p 00000000 00:00 0 
b77c9000-b77cd000 rw-p 00000000 00:00 0 
bff50000-bff65000 rw-p 00000000 00:00 0          [stack]
/bin/sh: line 1: 19550 Aborted                 perl -CSD asyncSoftTest.t -tap > asyncSoftTest.tap
make[2]: [asyncSoftTest.tap] Error 134 (ignored)
perl -CSD asTest.t -tap > asTest.tap
perl -CSD analogMonitorTest.t -tap > analogMonitorTest.tap
Starting iocInit
perl -CSD regressTest.t -tap > regressTest.tap
make[2]: Leaving directory `<https://jenkins.aps.anl.gov/job/epics-base-3.16-linux32-test/ws/src/std/rec/test/O.linux-x86'>
make[1]: Leaving directory `<https://jenkins.aps.anl.gov/job/epics-base-3.16-linux32-test/ws/src/std/rec/test'>
make: Leaving directory `<https://jenkins.aps.anl.gov/job/epics-base-3.16-linux32-test/ws/src'>
+ make -s test-results
Breaktable.tap .. ok
DBD.tap ......... ok
Device.tap ...... ok
Driver.tap ...... ok
Function.tap .... ok
macLib.tap ...... ok
Menu.tap ........ ok
Recfield.tap .... ok
Recordtype.tap .. ok
Registrar.tap ... ok
Snippets.tap .... ok
Variable.tap .... ok
All tests successful.
Files=12, Tests=224,  1 wallclock secs ( 0.17 usr  0.06 sys +  0.01 cusr  0.01 csys =  0.25 CPU)
Result: PASS
epicsUnitTestTest.tap ........ ok
epicsTypesTest.tap ........... ok
epicsInlineTest.tap .......... ok
epicsCalcTest.tap ............ ok
epicsAlgorithmTest.tap ....... ok
epicsMathTest.tap ............ ok
epicsMMIOTest.tap ............ ok
epicsEllTest.tap ............. ok
epicsEnvTest.tap ............. ok
epicsErrlogTest.tap .......... ok
epicsStdioTest.tap ........... ok
epicsStdlibTest.tap .......... ok
epicsSockResolveTest.tap ..... ok
epicsStringTest.tap .......... ok
epicsTimeTest.tap ............ ok
epicsTimeZoneTest.tap ........ ok
epicsThreadTest.tap .......... ok
epicsThreadOnceTest.tap ...... ok
epicsThreadPriorityTest.tap .. ok
epicsThreadPrivateTest.tap ... ok
epicsThreadHooksTest.tap ..... ok
epicsThreadPoolTest.tap ...... ok
epicsExitTest.tap ............ ok
epicsTimerTest.tap ........... ok
ringPointerTest.tap .......... ok
ringBytesTest.tap ............ ok
epicsEventTest.tap ........... ok
epicsMutexTest.tap ........... ok
epicsSpinTest.tap ............ ok
epicsAtomicTest.tap .......... ok
macDefExpandTest.tap ......... ok
cvtFastTest.tap .............. ok
macLibTest.tap ............... ok
taskwdTest.tap ............... ok
blockingSockTest.tap ......... ok
epicsMessageQueueTest.tap .... ok
epicsStackTraceTest.tap ...... ok
ipAddrToAsciiTest.tap ........ ok
All tests successful.
Files=38, Tests=3964,  2 wallclock secs ( 1.55 usr  0.19 sys +  0.02 cusr  0.08 csys =  1.84 CPU)
Result: PASS
dbScanTest.tap ............... ok
dbShutdownTest.tap ........... ok
dbPutLinkTest.tap ............ ok
dbLockTest.tap ............... ok
dbStressTest.tap ............. ok
testdbConvert.tap ............ ok
callbackTest.tap ............. ok
callbackParallelTest.tap ..... ok
dbStateTest.tap .............. ok
dbCaStatsTest.tap ............ ok
dbCaLinkTest.tap ............. ok
scanIoTest.tap ............... ok
dbChannelTest.tap ............ ok
dbChArrTest.tap .............. ok
chfPluginTest.tap ............ ok
arrShorthandTest.tap ......... ok
recGblCheckDeadbandTest.tap .. ok
testPutGetTest.tap ........... ok
dbStaticTest.tap ............. ok
All tests successful.
Files=19, Tests=2790,  2 wallclock secs ( 1.37 usr  0.08 sys +  0.01 cusr  0.04 csys =  1.50 CPU)
Result: PASS
msi.tap .. ok
All tests successful.
Files=1, Tests=9,  0 wallclock secs ( 0.07 usr +  0.01 sys =  0.08 CPU)
Result: PASS
tsTest.tap .... ok
dbndTest.tap .. ok
arrTest.tap ... ok
syncTest.tap .. ok
All tests successful.
Files=4, Tests=1612,  1 wallclock secs ( 0.83 usr  0.03 sys +  0.00 cusr  0.01 csys =  0.87 CPU)
Result: PASS
arrayOpTest.tap ........... ok
recMiscTest.tap ........... ok
linkRetargetLinkTest.tap .. ok
linkInitTest.tap .......... ok
compressTest.tap .......... ok
asyncSoftTest.tap ......... 
All 128 subtests passed 
asTest.tap ................ ok
analogMonitorTest.tap ..... ok
regressTest.tap ........... ok

Test Summary Report
-------------------
asyncSoftTest.tap       (Wstat: 0 Tests: 128 Failed: 0)
  Parse errors: No plan found in TAP output
Files=9, Tests=2205,  1 wallclock secs ( 1.02 usr  0.05 sys +  0.00 cusr  0.02 csys =  1.09 CPU)
Result: FAIL
make[3]: *** [test-results] Error 1
make[2]: *** [test-results.linux-x86] Error 2
make[1]: *** [std/rec/test.test-results] Error 2
make: *** [src.test-results] Error 2
Build step 'Execute shell' marked build as failure
TAP Reports Processing: START
Looking for TAP results report in workspace using pattern: src/**/O.linux-x86/*.tap
Saving reports...
org.tap4j.parser.ParserException: Error parsing TAP Stream: Missing TAP Plan.
	at org.tap4j.parser.Tap13Parser.parseTapStream(Tap13Parser.java:230)
	at org.tap4j.parser.Tap13Parser.parseFile(Tap13Parser.java:193)
	at org.tap4j.plugin.TapParser.parse(TapParser.java:167)
	at org.tap4j.plugin.TapPublisher.loadResults(TapPublisher.java:540)
	at org.tap4j.plugin.TapPublisher.performImpl(TapPublisher.java:412)
	at org.tap4j.plugin.TapPublisher.perform(TapPublisher.java:371)
	at hudson.tasks.BuildStepCompatibilityLayer.perform(BuildStepCompatibilityLayer.java:78)
	at hudson.tasks.BuildStepMonitor$1.perform(BuildStepMonitor.java:20)
	at hudson.model.AbstractBuild$AbstractBuildExecution.perform(AbstractBuild.java:779)
	at hudson.model.AbstractBuild$AbstractBuildExecution.performAllBuildSteps(AbstractBuild.java:720)
	at hudson.model.Build$BuildExecution.post2(Build.java:186)
	at hudson.model.AbstractBuild$AbstractBuildExecution.post(AbstractBuild.java:665)
	at hudson.model.Run.execute(Run.java:1753)
	at hudson.model.FreeStyleBuild.run(FreeStyleBuild.java:43)
	at hudson.model.ResourceController.execute(ResourceController.java:98)
	at hudson.model.Executor.run(Executor.java:405)
Caused by: org.tap4j.parser.ParserException: Missing TAP Plan.
	at org.tap4j.parser.Tap13Parser.onFinish(Tap13Parser.java:399)
	at org.tap4j.parser.Tap13Parser.parseTapStream(Tap13Parser.java:227)
	... 15 more
TAP parse errors found in the build. Marking build as UNSTABLE
TAP Reports Processing: FINISH

Replies:
Jenkins build is back to normal : epics-base-3.16-linux32-test #83 APS Jenkins

Navigate by Date:
Prev: Build failed in Jenkins: epics-base-3.16-test #2 APS Jenkins
Next: Build failed in Jenkins: epics-base-3.16-test #3 APS Jenkins
Index: 2002  2003  2004  2005  2006  2007  2008  2009  2010  2011  2012  2013  2014  2015  2016  <2017
Navigate by Thread:
Prev: Jenkins build is back to normal : epics-base-3.16-test #4 APS Jenkins
Next: Jenkins build is back to normal : epics-base-3.16-linux32-test #83 APS Jenkins
Index: 2002  2003  2004  2005  2006  2007  2008  2009  2010  2011  2012  2013  2014  2015  2016  <2017
ANJ, 27 May 2017 Valid HTML 4.01! · Home · News · About · Base · Modules · Extensions · Distributions · Download ·
· EPICS V4 · IRMIS · Talk · Bugs · Documents · Links · Licensing ·