Argonne National Laboratory

Experimental Physics and
Industrial Control System

2002  2003  2004  2005  2006  2007  2008  2009  2010  2011  2012  2013  2014  2015  2016  <2017 Index 2002  2003  2004  2005  2006  2007  2008  2009  2010  2011  2012  2013  2014  2015  2016  <2017
<== Date ==> <== Thread ==>

Subject: Build failed in Jenkins: epics-base-3.16-test #2
From: APS Jenkins <aps-jenkins@anl.gov>
To: core-talk@aps.anl.gov
Date: Sat, 27 May 2017 21:10:43 -0500 (CDT)
See <https://jenkins.aps.anl.gov/job/epics-base-3.16-test/2/display/redirect>

------------------------------------------
[...truncated 67.22 KB...]
perl -CSD /Jenkins/jenkins/jobs/epics-base-3.16/workspace/bin/linux-x86_64/tap-to-junit-xml.pl --puretap --output dbScanTest.xml --input dbScanTest.tap dbScanTest
perl -CSD dbShutdownTest.t -tap > dbShutdownTest.tap
perl -CSD /Jenkins/jenkins/jobs/epics-base-3.16/workspace/bin/linux-x86_64/tap-to-junit-xml.pl --puretap --output dbShutdownTest.xml --input dbShutdownTest.tap dbShutdownTest
perl -CSD dbPutLinkTest.t -tap > dbPutLinkTest.tap
dbJLinkInit: lexical error: invalid char in json text.
                                  {"x":bbbb}
                     (right here) ------^

perl -CSD /Jenkins/jenkins/jobs/epics-base-3.16/workspace/bin/linux-x86_64/tap-to-junit-xml.pl --puretap --output dbPutLinkTest.xml --input dbPutLinkTest.tap dbPutLinkTest
perl -CSD dbLockTest.t -tap > dbLockTest.tap
perl -CSD /Jenkins/jenkins/jobs/epics-base-3.16/workspace/bin/linux-x86_64/tap-to-junit-xml.pl --puretap --output dbLockTest.xml --input dbLockTest.tap dbLockTest
perl -CSD dbStressTest.t -tap > dbStressTest.tap
perl -CSD /Jenkins/jenkins/jobs/epics-base-3.16/workspace/bin/linux-x86_64/tap-to-junit-xml.pl --puretap --output dbStressTest.xml --input dbStressTest.tap dbStressTest
perl -CSD testdbConvert.t -tap > testdbConvert.tap
perl -CSD /Jenkins/jenkins/jobs/epics-base-3.16/workspace/bin/linux-x86_64/tap-to-junit-xml.pl --puretap --output testdbConvert.xml --input testdbConvert.tap testdbConvert
perl -CSD callbackTest.t -tap > callbackTest.tap
perl -CSD /Jenkins/jenkins/jobs/epics-base-3.16/workspace/bin/linux-x86_64/tap-to-junit-xml.pl --puretap --output callbackTest.xml --input callbackTest.tap callbackTest
perl -CSD callbackParallelTest.t -tap > callbackParallelTest.tap
perl -CSD /Jenkins/jenkins/jobs/epics-base-3.16/workspace/bin/linux-x86_64/tap-to-junit-xml.pl --puretap --output callbackParallelTest.xml --input callbackParallelTest.tap callbackParallelTest
perl -CSD dbStateTest.t -tap > dbStateTest.tap
perl -CSD /Jenkins/jenkins/jobs/epics-base-3.16/workspace/bin/linux-x86_64/tap-to-junit-xml.pl --puretap --output dbStateTest.xml --input dbStateTest.tap dbStateTest
perl -CSD dbCaStatsTest.t -tap > dbCaStatsTest.tap
perl -CSD /Jenkins/jenkins/jobs/epics-base-3.16/workspace/bin/linux-x86_64/tap-to-junit-xml.pl --puretap --output dbCaStatsTest.xml --input dbCaStatsTest.tap dbCaStatsTest
perl -CSD dbCaLinkTest.t -tap > dbCaLinkTest.tap
perl -CSD /Jenkins/jenkins/jobs/epics-base-3.16/workspace/bin/linux-x86_64/tap-to-junit-xml.pl --puretap --output dbCaLinkTest.xml --input dbCaLinkTest.tap dbCaLinkTest
perl -CSD scanIoTest.t -tap > scanIoTest.tap
perl -CSD /Jenkins/jenkins/jobs/epics-base-3.16/workspace/bin/linux-x86_64/tap-to-junit-xml.pl --puretap --output scanIoTest.xml --input scanIoTest.tap scanIoTest
perl -CSD dbChannelTest.t -tap > dbChannelTest.tap
perl -CSD /Jenkins/jenkins/jobs/epics-base-3.16/workspace/bin/linux-x86_64/tap-to-junit-xml.pl --puretap --output dbChannelTest.xml --input dbChannelTest.tap dbChannelTest
perl -CSD dbChArrTest.t -tap > dbChArrTest.tap
Starting iocInit
Warning: Duplicate EPICS CA Address list entry "10.8.0.255:5065" discarded
iocRun: All initialization complete
perl -CSD /Jenkins/jenkins/jobs/epics-base-3.16/workspace/bin/linux-x86_64/tap-to-junit-xml.pl --puretap --output dbChArrTest.xml --input dbChArrTest.tap dbChArrTest
perl -CSD chfPluginTest.t -tap > chfPluginTest.tap
chfConfigParseStart: plugin pvt alloc failed
perl -CSD /Jenkins/jenkins/jobs/epics-base-3.16/workspace/bin/linux-x86_64/tap-to-junit-xml.pl --puretap --output chfPluginTest.xml --input chfPluginTest.tap chfPluginTest
perl -CSD arrShorthandTest.t -tap > arrShorthandTest.tap
perl -CSD /Jenkins/jenkins/jobs/epics-base-3.16/workspace/bin/linux-x86_64/tap-to-junit-xml.pl --puretap --output arrShorthandTest.xml --input arrShorthandTest.tap arrShorthandTest
perl -CSD recGblCheckDeadbandTest.t -tap > recGblCheckDeadbandTest.tap
perl -CSD /Jenkins/jenkins/jobs/epics-base-3.16/workspace/bin/linux-x86_64/tap-to-junit-xml.pl --puretap --output recGblCheckDeadbandTest.xml --input recGblCheckDeadbandTest.tap recGblCheckDeadbandTest
perl -CSD testPutGetTest.t -tap > testPutGetTest.tap
perl -CSD /Jenkins/jenkins/jobs/epics-base-3.16/workspace/bin/linux-x86_64/tap-to-junit-xml.pl --puretap --output testPutGetTest.xml --input testPutGetTest.tap testPutGetTest
perl -CSD dbStaticTest.t -tap > dbStaticTest.tap
perl -CSD /Jenkins/jenkins/jobs/epics-base-3.16/workspace/bin/linux-x86_64/tap-to-junit-xml.pl --puretap --output dbStaticTest.xml --input dbStaticTest.tap dbStaticTest
make[2]: Leaving directory `/Jenkins/jenkins/jobs/epics-base-3.16/workspace/src/ioc/db/test/O.linux-x86_64'
make[1]: Leaving directory `/Jenkins/jenkins/jobs/epics-base-3.16/workspace/src/ioc/db/test'
make -C ioc/dbtemplate/test junitfiles 
make[1]: Entering directory `/Jenkins/jenkins/jobs/epics-base-3.16/workspace/src/ioc/dbtemplate/test'
make -C O.linux-x86_64 -f ../Makefile TOP=../../../../.. \
    T_A=linux-x86_64 junitfiles
make[2]: Entering directory `/Jenkins/jenkins/jobs/epics-base-3.16/workspace/src/ioc/dbtemplate/test/O.linux-x86_64'
perl -CSD msi.t -tap > msi.tap
perl -CSD /Jenkins/jenkins/jobs/epics-base-3.16/workspace/bin/linux-x86_64/tap-to-junit-xml.pl --puretap --output msi.xml --input msi.tap msi
make[2]: Leaving directory `/Jenkins/jenkins/jobs/epics-base-3.16/workspace/src/ioc/dbtemplate/test/O.linux-x86_64'
make[1]: Leaving directory `/Jenkins/jenkins/jobs/epics-base-3.16/workspace/src/ioc/dbtemplate/test'
make -C ./std junitfiles 
make[1]: Entering directory `/Jenkins/jenkins/jobs/epics-base-3.16/workspace/src/std'
make -C O.linux-x86_64 -f ../Makefile TOP=../../.. \
    T_A=linux-x86_64 junitfiles
make[2]: Entering directory `/Jenkins/jenkins/jobs/epics-base-3.16/workspace/src/std/O.linux-x86_64'
make[2]: Nothing to be done for `junitfiles'.
make[2]: Leaving directory `/Jenkins/jenkins/jobs/epics-base-3.16/workspace/src/std/O.linux-x86_64'
make[1]: Leaving directory `/Jenkins/jenkins/jobs/epics-base-3.16/workspace/src/std'
make -C std/filters/test junitfiles 
make[1]: Entering directory `/Jenkins/jenkins/jobs/epics-base-3.16/workspace/src/std/filters/test'
make -C O.linux-x86_64 -f ../Makefile TOP=../../../../.. \
    T_A=linux-x86_64 junitfiles
make[2]: Entering directory `/Jenkins/jenkins/jobs/epics-base-3.16/workspace/src/std/filters/test/O.linux-x86_64'
perl -CSD tsTest.t -tap > tsTest.tap
perl -CSD /Jenkins/jenkins/jobs/epics-base-3.16/workspace/bin/linux-x86_64/tap-to-junit-xml.pl --puretap --output tsTest.xml --input tsTest.tap tsTest
perl -CSD dbndTest.t -tap > dbndTest.tap
perl -CSD /Jenkins/jenkins/jobs/epics-base-3.16/workspace/bin/linux-x86_64/tap-to-junit-xml.pl --puretap --output dbndTest.xml --input dbndTest.tap dbndTest
perl -CSD arrTest.t -tap > arrTest.tap
perl -CSD /Jenkins/jenkins/jobs/epics-base-3.16/workspace/bin/linux-x86_64/tap-to-junit-xml.pl --puretap --output arrTest.xml --input arrTest.tap arrTest
perl -CSD syncTest.t -tap > syncTest.tap
perl -CSD /Jenkins/jenkins/jobs/epics-base-3.16/workspace/bin/linux-x86_64/tap-to-junit-xml.pl --puretap --output syncTest.xml --input syncTest.tap syncTest
make[2]: Leaving directory `/Jenkins/jenkins/jobs/epics-base-3.16/workspace/src/std/filters/test/O.linux-x86_64'
make[1]: Leaving directory `/Jenkins/jenkins/jobs/epics-base-3.16/workspace/src/std/filters/test'
make -C std/rec/test junitfiles 
make[1]: Entering directory `/Jenkins/jenkins/jobs/epics-base-3.16/workspace/src/std/rec/test'
make -C O.linux-x86_64 -f ../Makefile TOP=../../../../.. \
    T_A=linux-x86_64 junitfiles
make[2]: Entering directory `/Jenkins/jenkins/jobs/epics-base-3.16/workspace/src/std/rec/test/O.linux-x86_64'
perl -CSD arrayOpTest.t -tap > arrayOpTest.tap
perl -CSD /Jenkins/jenkins/jobs/epics-base-3.16/workspace/bin/linux-x86_64/tap-to-junit-xml.pl --puretap --output arrayOpTest.xml --input arrayOpTest.tap arrayOpTest
perl -CSD recMiscTest.t -tap > recMiscTest.tap
perl -CSD /Jenkins/jenkins/jobs/epics-base-3.16/workspace/bin/linux-x86_64/tap-to-junit-xml.pl --puretap --output recMiscTest.xml --input recMiscTest.tap recMiscTest
perl -CSD linkRetargetLinkTest.t -tap > linkRetargetLinkTest.tap
perl -CSD /Jenkins/jenkins/jobs/epics-base-3.16/workspace/bin/linux-x86_64/tap-to-junit-xml.pl --puretap --output linkRetargetLinkTest.xml --input linkRetargetLinkTest.tap linkRetargetLinkTest
perl -CSD linkInitTest.t -tap > linkInitTest.tap
perl -CSD /Jenkins/jenkins/jobs/epics-base-3.16/workspace/bin/linux-x86_64/tap-to-junit-xml.pl --puretap --output linkInitTest.xml --input linkInitTest.tap linkInitTest
perl -CSD compressTest.t -tap > compressTest.tap
perl -CSD /Jenkins/jenkins/jobs/epics-base-3.16/workspace/bin/linux-x86_64/tap-to-junit-xml.pl --puretap --output compressTest.xml --input compressTest.tap compressTest
perl -CSD asyncSoftTest.t -tap > asyncSoftTest.tap
*** Error in `./asyncSoftTest': double free or corruption (!prev): 0x00000000014a98b0 ***
======= Backtrace: =========
/lib64/libc.so.6(+0x7c503)[0x7fc83b03d503]
/Jenkins/jenkins/jobs/epics-base-3.16/workspace/lib/linux-x86_64/libdbRecStd.so.3.16.1(+0x3831e)[0x7fc83c34331e]
/Jenkins/jenkins/jobs/epics-base-3.16/workspace/lib/linux-x86_64/libdbCore.so.3.16.1(+0x5b5a9)[0x7fc83c0d95a9]
/Jenkins/jenkins/jobs/epics-base-3.16/workspace/lib/linux-x86_64/libdbCore.so.3.16.1(iocShutdown+0x61)[0x7fc83c0da031]
/Jenkins/jenkins/jobs/epics-base-3.16/workspace/lib/linux-x86_64/libdbCore.so.3.16.1(testIocShutdownOk+0x46)[0x7fc83c0c77e6]
./asyncSoftTest(main+0x5eb)[0x40499b]
/lib64/libc.so.6(__libc_start_main+0xf5)[0x7fc83afe2b35]
./asyncSoftTest[0x405236]
======= Memory map: ========
00400000-00407000 r-xp 00000000 00:27 1963985085                         /Jenkins/jenkins/jobs/epics-base-3.16/workspace/src/std/rec/test/O.linux-x86_64/asyncSoftTest
00606000-00607000 r--p 00006000 00:27 1963985085                         /Jenkins/jenkins/jobs/epics-base-3.16/workspace/src/std/rec/test/O.linux-x86_64/asyncSoftTest
00607000-00608000 rw-p 00007000 00:27 1963985085                         /Jenkins/jenkins/jobs/epics-base-3.16/workspace/src/std/rec/test/O.linux-x86_64/asyncSoftTest
013e6000-014f2000 rw-p 00000000 00:00 0                                  [heap]
7fc7fc000000-7fc7fc021000 rw-p 00000000 00:00 0 
7fc7fc021000-7fc800000000 ---p 00000000 00:00 0 
7fc804000000-7fc804021000 rw-p 00000000 00:00 0 
7fc804021000-7fc808000000 ---p 00000000 00:00 0 
7fc808000000-7fc808021000 rw-p 00000000 00:00 0 
7fc808021000-7fc80c000000 ---p 00000000 00:00 0 
7fc80c000000-7fc80c021000 rw-p 00000000 00:00 0 
7fc80c021000-7fc810000000 ---p 00000000 00:00 0 
7fc810000000-7fc810021000 rw-p 00000000 00:00 0 
7fc810021000-7fc814000000 ---p 00000000 00:00 0 
7fc814000000-7fc814021000 rw-p 00000000 00:00 0 
7fc814021000-7fc818000000 ---p 00000000 00:00 0 
7fc818000000-7fc818021000 rw-p 00000000 00:00 0 
7fc818021000-7fc81c000000 ---p 00000000 00:00 0 
7fc81c000000-7fc81c021000 rw-p 00000000 00:00 0 
7fc81c021000-7fc820000000 ---p 00000000 00:00 0 
7fc820000000-7fc820021000 rw-p 00000000 00:00 0 
7fc820021000-7fc824000000 ---p 00000000 00:00 0 
7fc824000000-7fc824021000 rw-p 00000000 00:00 0 
7fc824021000-7fc828000000 ---p 00000000 00:00 0 
7fc828000000-7fc828029000 rw-p 00000000 00:00 0 
7fc828029000-7fc82c000000 ---p 00000000 00:00 0 
7fc82c000000-7fc82c021000 rw-p 00000000 00:00 0 
7fc82c021000-7fc830000000 ---p 00000000 00:00 0 
7fc830000000-7fc830021000 rw-p 00000000 00:00 0 
7fc830021000-7fc834000000 ---p 00000000 00:00 0 
7fc834000000-7fc834021000 rw-p 00000000 00:00 0 
7fc834021000-7fc838000000 ---p 00000000 00:00 0 
7fc83831a000-7fc83831b000 ---p 00000000 00:00 0 
7fc83831b000-7fc83841b000 rw-p 00000000 00:00 0 
7fc83841b000-7fc83841c000 ---p 00000000 00:00 0 
7fc83841c000-7fc83861c000 rw-p 00000000 00:00 0                          [stack:24469]
7fc83861c000-7fc83861d000 ---p 00000000 00:00 0 
7fc83861d000-7fc83881d000 rw-p 00000000 00:00 0                          [stack:24468]
7fc83881d000-7fc83881e000 ---p 00000000 00:00 0 
7fc83881e000-7fc838a1e000 rw-p 00000000 00:00 0                          [stack:24467]
7fc838a1e000-7fc838a1f000 ---p 00000000 00:00 0 
7fc838a1f000-7fc838c1f000 rw-p 00000000 00:00 0                          [stack:24466]
7fc838c1f000-7fc838c20000 ---p 00000000 00:00 0 
7fc838c20000-7fc838e20000 rw-p 00000000 00:00 0                          [stack:24465]
7fc838e20000-7fc838e21000 ---p 00000000 00:00 0 
7fc838e21000-7fc839021000 rw-p 00000000 00:00 0                          [stack:24464]
7fc839021000-7fc839022000 ---p 00000000 00:00 0 
7fc839022000-7fc839222000 rw-p 00000000 00:00 0                          [stack:24463]
7fc839222000-7fc839223000 ---p 00000000 00:00 0 
7fc839223000-7fc839423000 rw-p 00000000 00:00 0                          [stack:24462]
7fc839423000-7fc839424000 ---p 00000000 00:00 0 
7fc839424000-7fc839624000 rw-p 00000000 00:00 0                          [stack:24461]
7fc839624000-7fc839625000 ---p 00000000 00:00 0 
7fc839625000-7fc839825000 rw-p 00000000 00:00 0                          [stack:24460]
7fc839825000-7fc839826000 ---p 00000000 00:00 0 
7fc839826000-7fc839a26000 rw-p 00000000 00:00 0                          [stack:24459]
7fc839a26000-7fc839a27000 ---p 00000000 00:00 0 
7fc839a27000-7fc839c27000 rw-p 00000000 00:00 0                          [stack:24458]
7fc839c27000-7fc839c28000 ---p 00000000 00:00 0 
7fc839c28000-7fc839d28000 rw-p 00000000 00:00 0                          [stack:24457]
7fc839d28000-7fc839d29000 ---p 00000000 00:00 0 
7fc839d29000-7fc83a529000 rw-p 00000000 00:00 0 
7fc83a529000-7fc83a54e000 r-xp 00000000 fd:00 100672917                  /usr/lib64/libtinfo.so.5.9
7fc83a54e000-7fc83a74e000 ---p 00025000 fd:00 100672917                  /usr/lib64/libtinfo.so.5.9
7fc83a74e000-7fc83a752000 r--p 00025000 fd:00 100672917                  /usr/lib64/libtinfo.so.5.9
7fc83a752000-7fc83a753000 rw-p 00029000 fd:00 100672917                  /usr/lib64/libtinfo.so.5.9
7fc83a753000-7fc83a755000 r-xp 00000000 fd:00 100672485                  /usr/lib64/libdl-2.17.so
7fc83a755000-7fc83a955000 ---p 00002000 fd:00 100672485                  /usr/lib64/libdl-2.17.so
7fc83a955000-7fc83a956000 r--p 00002000 fd:00 100672485                  /usr/lib64/libdl-2.17.so
7fc83a956000-7fc83a957000 rw-p 00003000 fd:00 100672485                  /usr/lib64/libdl-2.17.so
7fc83a957000-7fc83a95e000 r-xp 00000000 fd:00 100672509                  /usr/lib64/librt-2.17.so
7fc83a95e000-7fc83ab5d000 ---p 00007000 fd:00 100672509                  /usr/lib64/librt-2.17.so
7fc83ab5d000-7fc83ab5e000 r--p 00006000 fd:00 100672509                  /usr/lib64/librt-2.17.so
7fc83ab5e000-7fc83ab5f000 rw-p 00007000 fd:00 100672509                  /usr/lib64/librt-2.17.so
7fc83ab5f000-7fc83ab9b000 r-xp 00000000 fd:00 100778360                  /usr/lib64/libreadline.so.6.2
7fc83ab9b000-7fc83ad9b000 ---p 0003c000 fd:00 100778360                  /usr/lib64/libreadline.so.6.2
7fc83ad9b000-7fc83ad9d000 r--p 0003c000 fd:00 100778360                  /usr/lib64/libreadline.so.6.2
7fc83ad9d000-7fc83ada3000 rw-p 0003e000 fd:00 100778360                  /usr/lib64/libreadline.so.6.2
7fc83ada3000-7fc83ada5000 rw-p 00000000 00:00 0 
7fc83ada5000-7fc83adbc000 r-xp 00000000 fd:00 100672505                  /usr/lib64/libpthread-2.17.so
7fc83adbc000-7fc83afbb000 ---p 00017000 fd:00 100672505                  /usr/lib64/libpthread-2.17.so
7fc83afbb000-7fc83afbc000 r--p 00016000 fd:00 100672505                  /usr/lib64/libpthread-2.17.so
7fc83afbc000-7fc83afbd000 rw-p 00017000 fd:00 100672505                  /usr/lib64/libpthread-2.17.so
7fc83afbd000-7fc83afc1000 rw-p 00000000 00:00 0 
7fc83afc1000-7fc83b177000 r-xp 00000000 fd:00 100672479                  /usr/lib64/libc-2.17.so
7fc83b177000-7fc83b377000 ---p 001b6000 fd:00 100672479                  /usr/lib64/libc-2.17.so
7fc83b377000-7fc83b37b000 r--p 001b6000 fd:00 100672479                  /usr/lib64/libc-2.17.so
7fc83b37b000-7fc83b37d000 rw-p 001ba000 fd:00 100672479                  /usr/lib64/libc-2.17.so
7fc83b37d000-7fc83b382000 rw-p 00000000 00:00 0 
7fc83b382000-7fc83b397000 r-xp 00000000 fd:00 100788836                  /usr/lib64/libgcc_s-4.8.5-20150702.so.1
7fc83b397000-7fc83b596000 ---p 00015000 fd:00 100788836                  /usr/lib64/libgcc_s-4.8.5-20150702.so.1
7fc83b596000-7fc83b597000 r--p 00014000 fd:00 100788836                  /usr/lib64/libgcc_s-4.8.5-20150702.so.1
7fc83b597000-7fc83b598000 rw-p 00015000 fd:00 100788836                  /usr/lib64/libgcc_s-4.8.5-20150702.so.1
7fc83b598000-7fc83b698000 r-xp 00000000 fd:00 100672487                  /usr/lib64/libm-2.17.so
7fc83b698000-7fc83b898000 ---p 00100000 fd:00 100672487                  /usr/lib64/libm-2.17.so
7fc83b898000-7fc83b899000 r--p 00100000 fd:00 100672487                  /usr/lib64/libm-2.17.so
7fc83b899000-7fc83b89a000 rw-p 00101000 fd:00 100672487                  /usr/lib64/libm-2.17.so
7fc83b89a000-7fc83b983000 r-xp 00000000 fd:00 100672866                  /usr/lib64/libstdc++.so.6.0.19
7fc83b983000-7fc83bb83000 ---p 000e9000 fd:00 100672866                  /usr/lib64/libstdc++.so.6.0.19
7fc83bb83000-7fc83bb8b000 r--p 000e9000 fd:00 100672866                  /usr/lib64/libstdc++.so.6.0.19
7fc83bb8b000-7fc83bb8d000 rw-p 000f1000 fd:00 100672866                  /usr/lib64/libstdc++.so.6.0.19
7fc83bb8d000-7fc83bba2000 rw-p 00000000 00:00 0 
7fc83bba2000-7fc83bc0c000 r-xp 00000000 00:27 1963930742                 /Jenkins/jenkins/jobs/epics-base-3.16/workspace/lib/linux-x86_64/libCom.so.3.16.1
7fc83bc0c000-7fc83be0c000 ---p 0006a000 00:27 1963930742                 /Jenkins/jenkins/jobs/epics-base-3.16/workspace/lib/linux-x86_64/libCom.so.3.16.1
7fc83be0c000-7fc83be0f000 r--p 0006a000 00:27 1963930742                 /Jenkins/jenkins/jobs/epics-base-3.16/workspace/lib/linux-x86_64/libCom.so.3.16.1
7fc83be0f000-7fc83be12000 rw-p 0006d000 00:27 1963930742                 /Jenkins/jenkins/jobs/epics-base-3.16/workspace/lib/linux-x86_64/libCom.so.3.16.1
7fc83be12000-7fc83be14000 rw-p 00000000 00:00 0 
7fc83be14000-7fc83be79000 r-xp 00000000 00:27 1963930745                 /Jenkins/jenkins/jobs/epics-base-3.16/workspace/lib/linux-x86_64/libca.so.3.16.1
7fc83be79000-7fc83c078000 ---p 00065000 00:27 1963930745                 /Jenkins/jenkins/jobs/epics-base-3.16/workspace/lib/linux-x86_64/libca.so.3.16.1
7fc83c078000-7fc83c07c000 r--p 00064000 00:27 1963930745                 /Jenkins/jenkins/jobs/epics-base-3.16/workspace/lib/linux-x86_64/libca.so.3.16.1
7fc83c07c000-7fc83c07e000 rw-p 00068000 00:27 1963930745                 /Jenkins/jenkins/jobs/epics-base-3.16/workspace/lib/linux-x86_64/libca.so.3.16.1
7fc83c07e000-7fc83c101000 r-xp 00000000 00:27 1964683282                 /Jenkins/jenkins/jobs/epics-base-3.16/workspace/lib/linux-x86_64/libdbCore.so.3.16.1
7fc83c101000-7fc83c300000 ---p 00083000 00:27 1964683282                 /Jenkins/jenkins/jobs/epics-base-3.16/workspace/lib/linux-x86_64/libdbCore.so.3.16.1
7fc83c300000-7fc83c303000 r--p 00082000 00:27 1964683282                 /Jenkins/jenkins/jobs/epics-base-3.16/workspace/lib/linux-x86_64/libdbCore.so.3.16.1
7fc83c303000-7fc83c307000 rw-p 00085000 00:27 1964683282                 /Jenkins/jenkins/jobs/epics-base-3.16/workspace/lib/linux-x86_64/libdbCore.so.3.16.1
7fc83c307000-7fc83c30b000 rw-p 00000000 00:00 0 
7fc83c30b000-7fc83c352000 r-xp 00000000 00:27 1963356341                 /Jenkins/jenkins/jobs/epics-base-3.16/workspace/lib/linux-x86_64/libdbRecStd.so.3.16.1
7fc83c352000-7fc83c552000 ---p 00047000 00:27 1963356341                 /Jenkins/jenkins/jobs/epics-base-3.16/workspace/lib/linux-x86_64/libdbRecStd.so.3.16.1
7fc83c552000-7fc83c553000 r--p 00047000 00:27 1963356341                 /Jenkins/jenkins/jobs/epics-base-3.16/workspace/lib/linux-x86_64/libdbRecStd.so.3.16.1
7fc83c553000-7fc83c557000 rw-p 00048000 00:27 1963356341                 /Jenkins/jenkins/jobs/epics-base-3.16/workspace/lib/linux-x86_64/libdbRecStd.so.3.16.1
7fc83c557000-7fc83c577000 r-xp 00000000 fd:00 100672472                  /usr/lib64/ld-2.17.so
7fc83c61f000-7fc83c620000 ---p 00000000 00:00 0 
7fc83c620000-7fc83c6a0000 rw-p 00000000 00:00 0                          [stack:24456]
7fc83c6a0000-7fc83c6a1000 ---p 00000000 00:00 0 
7fc83c6a1000-7fc83c729000 rw-p 00000000 00:00 0                          [stack:24455]
7fc83c763000-7fc83c776000 rw-p 00000000 00:00 0 
7fc83c776000-7fc83c777000 r--p 0001f000 fd:00 100672472                  /usr/lib64/ld-2.17.so
7fc83c777000-7fc83c778000 rw-p 00020000 fd:00 100672472                  /usr/lib64/ld-2.17.so
7fc83c778000-7fc83c779000 rw-p 00000000 00:00 0 
7ffca9f72000-7ffca9f93000 rw-p 00000000 00:00 0                          [stack]
7ffca9fde000-7ffca9fe0000 r-xp 00000000 00:00 0                          [vdso]
ffffffffff600000-ffffffffff601000 r-xp 00000000 00:00 0                  [vsyscall]
/bin/sh: line 1: 24453 Aborted                 (core dumped) perl -CSD asyncSoftTest.t -tap > asyncSoftTest.tap
make[2]: [asyncSoftTest.tap] Error 134 (ignored)
perl -CSD /Jenkins/jenkins/jobs/epics-base-3.16/workspace/bin/linux-x86_64/tap-to-junit-xml.pl --puretap --output asyncSoftTest.xml --input asyncSoftTest.tap asyncSoftTest
make[2]: *** [asyncSoftTest.xml] Error 86
make[2]: Leaving directory `/Jenkins/jenkins/jobs/epics-base-3.16/workspace/src/std/rec/test/O.linux-x86_64'
make[1]: *** [junitfiles.linux-x86_64] Error 2
make[1]: Leaving directory `/Jenkins/jenkins/jobs/epics-base-3.16/workspace/src/std/rec/test'
make: *** [std/rec/test.junitfiles] Error 2
make: Leaving directory `/Jenkins/jenkins/jobs/epics-base-3.16/workspace/src'
Build step 'Execute shell' marked build as failure
Recording test results

Replies:
Build failed in Jenkins: epics-base-3.16-test #3 APS Jenkins

Navigate by Date:
Prev: Build failed in Jenkins: epics-base-3.16-vx69 #124 APS Jenkins
Next: Build failed in Jenkins: epics-base-3.16-linux32-test #82 APS Jenkins
Index: 2002  2003  2004  2005  2006  2007  2008  2009  2010  2011  2012  2013  2014  2015  2016  <2017
Navigate by Thread:
Prev: Jenkins build is back to normal : epics-base-3.16-vx69 #125 APS Jenkins
Next: Build failed in Jenkins: epics-base-3.16-test #3 APS Jenkins
Index: 2002  2003  2004  2005  2006  2007  2008  2009  2010  2011  2012  2013  2014  2015  2016  <2017
ANJ, 27 May 2017 Valid HTML 4.01! · Home · News · About · Base · Modules · Extensions · Distributions · Download ·
· EPICS V4 · IRMIS · Talk · Bugs · Documents · Links · Licensing ·