Argonne National Laboratory

Experimental Physics and
Industrial Control System

2002  2003  2004  2005  2006  2007  2008  2009  2010  2011  2012  2013  2014  2015  2016  <2017 Index 2002  2003  2004  2005  2006  2007  2008  2009  2010  2011  2012  2013  2014  2015  2016  <2017
<== Date ==> <== Thread ==>

Subject: Build failed in Jenkins: epics-base-3.16 #105
From: APS Jenkins <aps-jenkins@anl.gov>
To: core-talk@aps.anl.gov
Date: Thu, 4 May 2017 12:49:45 -0500 (CDT)
See <https://jenkins.aps.anl.gov/job/epics-base-3.16/105/display/redirect>

------------------------------------------
Started by user Andrew Johnson
[EnvInject] - Loading node environment variables.
Building on master in workspace <https://jenkins.aps.anl.gov/job/epics-base-3.16/ws/>
 > git rev-parse --is-inside-work-tree # timeout=10
Fetching changes from the remote Git repository
 > git config remote.origin.url https://git.launchpad.net/epics-base # timeout=10
Fetching upstream changes from https://git.launchpad.net/epics-base
 > git --version # timeout=10
Setting http proxy: webproxy1.anl.gov:9091
 > git fetch --tags --progress https://git.launchpad.net/epics-base +refs/heads/*:refs/remotes/origin/*
ERROR: Error fetching remote repo 'origin'
hudson.plugins.git.GitException: Failed to fetch from https://git.launchpad.net/epics-base
	at hudson.plugins.git.GitSCM.fetchFrom(GitSCM.java:809)
	at hudson.plugins.git.GitSCM.retrieveChanges(GitSCM.java:1076)
	at hudson.plugins.git.GitSCM.checkout(GitSCM.java:1107)
	at hudson.scm.SCM.checkout(SCM.java:496)
	at hudson.model.AbstractProject.checkout(AbstractProject.java:1278)
	at hudson.model.AbstractBuild$AbstractBuildExecution.defaultCheckout(AbstractBuild.java:604)
	at jenkins.scm.SCMCheckoutStrategy.checkout(SCMCheckoutStrategy.java:86)
	at hudson.model.AbstractBuild$AbstractBuildExecution.run(AbstractBuild.java:529)
	at hudson.model.Run.execute(Run.java:1728)
	at hudson.model.FreeStyleBuild.run(FreeStyleBuild.java:43)
	at hudson.model.ResourceController.execute(ResourceController.java:98)
	at hudson.model.Executor.run(Executor.java:405)
Caused by: hudson.plugins.git.GitException: Command "git fetch --tags --progress https://git.launchpad.net/epics-base +refs/heads/*:refs/remotes/origin/*" returned status code 128:
stdout: 
stderr: fatal: unable to access 'https://git.launchpad.net/epics-base/': The requested URL returned error: 500

	at org.jenkinsci.plugins.gitclient.CliGitAPIImpl.launchCommandIn(CliGitAPIImpl.java:1833)
	at org.jenkinsci.plugins.gitclient.CliGitAPIImpl.launchCommandWithCredentials(CliGitAPIImpl.java:1552)
	at org.jenkinsci.plugins.gitclient.CliGitAPIImpl.access$300(CliGitAPIImpl.java:66)
	at org.jenkinsci.plugins.gitclient.CliGitAPIImpl$1.execute(CliGitAPIImpl.java:343)
	at hudson.plugins.git.GitSCM.fetchFrom(GitSCM.java:807)
	... 11 more
ERROR: null
TAP Reports Processing: START
Looking for TAP results report in workspace using pattern: src/**/O.linux-x86_64/*.tap
Saving reports...
Processing '/var/lib/jenkins/jobs/epics-base-3.16/builds/105/tap-master-files/src/ioc/db/test/O.linux-x86_64/arrShorthandTest.tap'
Parsing TAP test result [/var/lib/jenkins/jobs/epics-base-3.16/builds/105/tap-master-files/src/ioc/db/test/O.linux-x86_64/arrShorthandTest.tap].
Processing '/var/lib/jenkins/jobs/epics-base-3.16/builds/105/tap-master-files/src/ioc/db/test/O.linux-x86_64/callbackParallelTest.tap'
Parsing TAP test result [/var/lib/jenkins/jobs/epics-base-3.16/builds/105/tap-master-files/src/ioc/db/test/O.linux-x86_64/callbackParallelTest.tap].
Processing '/var/lib/jenkins/jobs/epics-base-3.16/builds/105/tap-master-files/src/ioc/db/test/O.linux-x86_64/callbackTest.tap'
Parsing TAP test result [/var/lib/jenkins/jobs/epics-base-3.16/builds/105/tap-master-files/src/ioc/db/test/O.linux-x86_64/callbackTest.tap].
Processing '/var/lib/jenkins/jobs/epics-base-3.16/builds/105/tap-master-files/src/ioc/db/test/O.linux-x86_64/chfPluginTest.tap'
Parsing TAP test result [/var/lib/jenkins/jobs/epics-base-3.16/builds/105/tap-master-files/src/ioc/db/test/O.linux-x86_64/chfPluginTest.tap].
Processing '/var/lib/jenkins/jobs/epics-base-3.16/builds/105/tap-master-files/src/ioc/db/test/O.linux-x86_64/dbCaLinkTest.tap'
Parsing TAP test result [/var/lib/jenkins/jobs/epics-base-3.16/builds/105/tap-master-files/src/ioc/db/test/O.linux-x86_64/dbCaLinkTest.tap].
Processing '/var/lib/jenkins/jobs/epics-base-3.16/builds/105/tap-master-files/src/ioc/db/test/O.linux-x86_64/dbCaStatsTest.tap'
Parsing TAP test result [/var/lib/jenkins/jobs/epics-base-3.16/builds/105/tap-master-files/src/ioc/db/test/O.linux-x86_64/dbCaStatsTest.tap].
Processing '/var/lib/jenkins/jobs/epics-base-3.16/builds/105/tap-master-files/src/ioc/db/test/O.linux-x86_64/dbChArrTest.tap'
Parsing TAP test result [/var/lib/jenkins/jobs/epics-base-3.16/builds/105/tap-master-files/src/ioc/db/test/O.linux-x86_64/dbChArrTest.tap].
Processing '/var/lib/jenkins/jobs/epics-base-3.16/builds/105/tap-master-files/src/ioc/db/test/O.linux-x86_64/dbChannelTest.tap'
Parsing TAP test result [/var/lib/jenkins/jobs/epics-base-3.16/builds/105/tap-master-files/src/ioc/db/test/O.linux-x86_64/dbChannelTest.tap].
Processing '/var/lib/jenkins/jobs/epics-base-3.16/builds/105/tap-master-files/src/ioc/db/test/O.linux-x86_64/dbLockTest.tap'
Parsing TAP test result [/var/lib/jenkins/jobs/epics-base-3.16/builds/105/tap-master-files/src/ioc/db/test/O.linux-x86_64/dbLockTest.tap].
Processing '/var/lib/jenkins/jobs/epics-base-3.16/builds/105/tap-master-files/src/ioc/db/test/O.linux-x86_64/dbPutLinkTest.tap'
Parsing TAP test result [/var/lib/jenkins/jobs/epics-base-3.16/builds/105/tap-master-files/src/ioc/db/test/O.linux-x86_64/dbPutLinkTest.tap].
Processing '/var/lib/jenkins/jobs/epics-base-3.16/builds/105/tap-master-files/src/ioc/db/test/O.linux-x86_64/dbScanTest.tap'
Parsing TAP test result [/var/lib/jenkins/jobs/epics-base-3.16/builds/105/tap-master-files/src/ioc/db/test/O.linux-x86_64/dbScanTest.tap].
Processing '/var/lib/jenkins/jobs/epics-base-3.16/builds/105/tap-master-files/src/ioc/db/test/O.linux-x86_64/dbShutdownTest.tap'
Parsing TAP test result [/var/lib/jenkins/jobs/epics-base-3.16/builds/105/tap-master-files/src/ioc/db/test/O.linux-x86_64/dbShutdownTest.tap].
Processing '/var/lib/jenkins/jobs/epics-base-3.16/builds/105/tap-master-files/src/ioc/db/test/O.linux-x86_64/dbStateTest.tap'
Parsing TAP test result [/var/lib/jenkins/jobs/epics-base-3.16/builds/105/tap-master-files/src/ioc/db/test/O.linux-x86_64/dbStateTest.tap].
Processing '/var/lib/jenkins/jobs/epics-base-3.16/builds/105/tap-master-files/src/ioc/db/test/O.linux-x86_64/dbStaticTest.tap'
Parsing TAP test result [/var/lib/jenkins/jobs/epics-base-3.16/builds/105/tap-master-files/src/ioc/db/test/O.linux-x86_64/dbStaticTest.tap].
Processing '/var/lib/jenkins/jobs/epics-base-3.16/builds/105/tap-master-files/src/ioc/db/test/O.linux-x86_64/dbStressTest.tap'
Parsing TAP test result [/var/lib/jenkins/jobs/epics-base-3.16/builds/105/tap-master-files/src/ioc/db/test/O.linux-x86_64/dbStressTest.tap].
Processing '/var/lib/jenkins/jobs/epics-base-3.16/builds/105/tap-master-files/src/ioc/db/test/O.linux-x86_64/recGblCheckDeadbandTest.tap'
Parsing TAP test result [/var/lib/jenkins/jobs/epics-base-3.16/builds/105/tap-master-files/src/ioc/db/test/O.linux-x86_64/recGblCheckDeadbandTest.tap].
Processing '/var/lib/jenkins/jobs/epics-base-3.16/builds/105/tap-master-files/src/ioc/db/test/O.linux-x86_64/scanIoTest.tap'
Parsing TAP test result [/var/lib/jenkins/jobs/epics-base-3.16/builds/105/tap-master-files/src/ioc/db/test/O.linux-x86_64/scanIoTest.tap].
Processing '/var/lib/jenkins/jobs/epics-base-3.16/builds/105/tap-master-files/src/ioc/db/test/O.linux-x86_64/testPutGetTest.tap'
Parsing TAP test result [/var/lib/jenkins/jobs/epics-base-3.16/builds/105/tap-master-files/src/ioc/db/test/O.linux-x86_64/testPutGetTest.tap].
Processing '/var/lib/jenkins/jobs/epics-base-3.16/builds/105/tap-master-files/src/ioc/db/test/O.linux-x86_64/testdbConvert.tap'
Parsing TAP test result [/var/lib/jenkins/jobs/epics-base-3.16/builds/105/tap-master-files/src/ioc/db/test/O.linux-x86_64/testdbConvert.tap].
Processing '/var/lib/jenkins/jobs/epics-base-3.16/builds/105/tap-master-files/src/ioc/dbtemplate/test/O.linux-x86_64/msi.tap'
Parsing TAP test result [/var/lib/jenkins/jobs/epics-base-3.16/builds/105/tap-master-files/src/ioc/dbtemplate/test/O.linux-x86_64/msi.tap].
Processing '/var/lib/jenkins/jobs/epics-base-3.16/builds/105/tap-master-files/src/libCom/test/O.linux-x86_64/blockingSockTest.tap'
Parsing TAP test result [/var/lib/jenkins/jobs/epics-base-3.16/builds/105/tap-master-files/src/libCom/test/O.linux-x86_64/blockingSockTest.tap].
Processing '/var/lib/jenkins/jobs/epics-base-3.16/builds/105/tap-master-files/src/libCom/test/O.linux-x86_64/epicsAlgorithmTest.tap'
Parsing TAP test result [/var/lib/jenkins/jobs/epics-base-3.16/builds/105/tap-master-files/src/libCom/test/O.linux-x86_64/epicsAlgorithmTest.tap].
Processing '/var/lib/jenkins/jobs/epics-base-3.16/builds/105/tap-master-files/src/libCom/test/O.linux-x86_64/epicsAtomicTest.tap'
Parsing TAP test result [/var/lib/jenkins/jobs/epics-base-3.16/builds/105/tap-master-files/src/libCom/test/O.linux-x86_64/epicsAtomicTest.tap].
Processing '/var/lib/jenkins/jobs/epics-base-3.16/builds/105/tap-master-files/src/libCom/test/O.linux-x86_64/epicsCalcTest.tap'
Parsing TAP test result [/var/lib/jenkins/jobs/epics-base-3.16/builds/105/tap-master-files/src/libCom/test/O.linux-x86_64/epicsCalcTest.tap].
Processing '/var/lib/jenkins/jobs/epics-base-3.16/builds/105/tap-master-files/src/libCom/test/O.linux-x86_64/epicsEllTest.tap'
Parsing TAP test result [/var/lib/jenkins/jobs/epics-base-3.16/builds/105/tap-master-files/src/libCom/test/O.linux-x86_64/epicsEllTest.tap].
Processing '/var/lib/jenkins/jobs/epics-base-3.16/builds/105/tap-master-files/src/libCom/test/O.linux-x86_64/epicsEnvTest.tap'
Parsing TAP test result [/var/lib/jenkins/jobs/epics-base-3.16/builds/105/tap-master-files/src/libCom/test/O.linux-x86_64/epicsEnvTest.tap].
Processing '/var/lib/jenkins/jobs/epics-base-3.16/builds/105/tap-master-files/src/libCom/test/O.linux-x86_64/epicsErrlogTest.tap'
Parsing TAP test result [/var/lib/jenkins/jobs/epics-base-3.16/builds/105/tap-master-files/src/libCom/test/O.linux-x86_64/epicsErrlogTest.tap].
Processing '/var/lib/jenkins/jobs/epics-base-3.16/builds/105/tap-master-files/src/libCom/test/O.linux-x86_64/epicsEventTest.tap'
Parsing TAP test result [/var/lib/jenkins/jobs/epics-base-3.16/builds/105/tap-master-files/src/libCom/test/O.linux-x86_64/epicsEventTest.tap].
Processing '/var/lib/jenkins/jobs/epics-base-3.16/builds/105/tap-master-files/src/libCom/test/O.linux-x86_64/epicsExitTest.tap'
Parsing TAP test result [/var/lib/jenkins/jobs/epics-base-3.16/builds/105/tap-master-files/src/libCom/test/O.linux-x86_64/epicsExitTest.tap].
Processing '/var/lib/jenkins/jobs/epics-base-3.16/builds/105/tap-master-files/src/libCom/test/O.linux-x86_64/epicsInlineTest.tap'
Parsing TAP test result [/var/lib/jenkins/jobs/epics-base-3.16/builds/105/tap-master-files/src/libCom/test/O.linux-x86_64/epicsInlineTest.tap].
Processing '/var/lib/jenkins/jobs/epics-base-3.16/builds/105/tap-master-files/src/libCom/test/O.linux-x86_64/epicsMMIOTest.tap'
Parsing TAP test result [/var/lib/jenkins/jobs/epics-base-3.16/builds/105/tap-master-files/src/libCom/test/O.linux-x86_64/epicsMMIOTest.tap].
Processing '/var/lib/jenkins/jobs/epics-base-3.16/builds/105/tap-master-files/src/libCom/test/O.linux-x86_64/epicsMathTest.tap'
Parsing TAP test result [/var/lib/jenkins/jobs/epics-base-3.16/builds/105/tap-master-files/src/libCom/test/O.linux-x86_64/epicsMathTest.tap].
Processing '/var/lib/jenkins/jobs/epics-base-3.16/builds/105/tap-master-files/src/libCom/test/O.linux-x86_64/epicsMessageQueueTest.tap'
Parsing TAP test result [/var/lib/jenkins/jobs/epics-base-3.16/builds/105/tap-master-files/src/libCom/test/O.linux-x86_64/epicsMessageQueueTest.tap].
Processing '/var/lib/jenkins/jobs/epics-base-3.16/builds/105/tap-master-files/src/libCom/test/O.linux-x86_64/epicsMutexTest.tap'
Parsing TAP test result [/var/lib/jenkins/jobs/epics-base-3.16/builds/105/tap-master-files/src/libCom/test/O.linux-x86_64/epicsMutexTest.tap].
Processing '/var/lib/jenkins/jobs/epics-base-3.16/builds/105/tap-master-files/src/libCom/test/O.linux-x86_64/epicsSockResolveTest.tap'
Parsing TAP test result [/var/lib/jenkins/jobs/epics-base-3.16/builds/105/tap-master-files/src/libCom/test/O.linux-x86_64/epicsSockResolveTest.tap].
Processing '/var/lib/jenkins/jobs/epics-base-3.16/builds/105/tap-master-files/src/libCom/test/O.linux-x86_64/epicsSpinTest.tap'
Parsing TAP test result [/var/lib/jenkins/jobs/epics-base-3.16/builds/105/tap-master-files/src/libCom/test/O.linux-x86_64/epicsSpinTest.tap].
Processing '/var/lib/jenkins/jobs/epics-base-3.16/builds/105/tap-master-files/src/libCom/test/O.linux-x86_64/epicsStackTraceTest.tap'
Parsing TAP test result [/var/lib/jenkins/jobs/epics-base-3.16/builds/105/tap-master-files/src/libCom/test/O.linux-x86_64/epicsStackTraceTest.tap].
Processing '/var/lib/jenkins/jobs/epics-base-3.16/builds/105/tap-master-files/src/libCom/test/O.linux-x86_64/epicsStdioTest.tap'
Parsing TAP test result [/var/lib/jenkins/jobs/epics-base-3.16/builds/105/tap-master-files/src/libCom/test/O.linux-x86_64/epicsStdioTest.tap].
Processing '/var/lib/jenkins/jobs/epics-base-3.16/builds/105/tap-master-files/src/libCom/test/O.linux-x86_64/epicsStdlibTest.tap'
Parsing TAP test result [/var/lib/jenkins/jobs/epics-base-3.16/builds/105/tap-master-files/src/libCom/test/O.linux-x86_64/epicsStdlibTest.tap].
Processing '/var/lib/jenkins/jobs/epics-base-3.16/builds/105/tap-master-files/src/libCom/test/O.linux-x86_64/epicsStringTest.tap'
Parsing TAP test result [/var/lib/jenkins/jobs/epics-base-3.16/builds/105/tap-master-files/src/libCom/test/O.linux-x86_64/epicsStringTest.tap].
Processing '/var/lib/jenkins/jobs/epics-base-3.16/builds/105/tap-master-files/src/libCom/test/O.linux-x86_64/epicsThreadHooksTest.tap'
Parsing TAP test result [/var/lib/jenkins/jobs/epics-base-3.16/builds/105/tap-master-files/src/libCom/test/O.linux-x86_64/epicsThreadHooksTest.tap].
Processing '/var/lib/jenkins/jobs/epics-base-3.16/builds/105/tap-master-files/src/libCom/test/O.linux-x86_64/epicsThreadOnceTest.tap'
Parsing TAP test result [/var/lib/jenkins/jobs/epics-base-3.16/builds/105/tap-master-files/src/libCom/test/O.linux-x86_64/epicsThreadOnceTest.tap].
Processing '/var/lib/jenkins/jobs/epics-base-3.16/builds/105/tap-master-files/src/libCom/test/O.linux-x86_64/epicsThreadPoolTest.tap'
Parsing TAP test result [/var/lib/jenkins/jobs/epics-base-3.16/builds/105/tap-master-files/src/libCom/test/O.linux-x86_64/epicsThreadPoolTest.tap].
Processing '/var/lib/jenkins/jobs/epics-base-3.16/builds/105/tap-master-files/src/libCom/test/O.linux-x86_64/epicsThreadPriorityTest.tap'
Parsing TAP test result [/var/lib/jenkins/jobs/epics-base-3.16/builds/105/tap-master-files/src/libCom/test/O.linux-x86_64/epicsThreadPriorityTest.tap].
Processing '/var/lib/jenkins/jobs/epics-base-3.16/builds/105/tap-master-files/src/libCom/test/O.linux-x86_64/epicsThreadPrivateTest.tap'
Parsing TAP test result [/var/lib/jenkins/jobs/epics-base-3.16/builds/105/tap-master-files/src/libCom/test/O.linux-x86_64/epicsThreadPrivateTest.tap].
Processing '/var/lib/jenkins/jobs/epics-base-3.16/builds/105/tap-master-files/src/libCom/test/O.linux-x86_64/epicsThreadTest.tap'
Parsing TAP test result [/var/lib/jenkins/jobs/epics-base-3.16/builds/105/tap-master-files/src/libCom/test/O.linux-x86_64/epicsThreadTest.tap].
Processing '/var/lib/jenkins/jobs/epics-base-3.16/builds/105/tap-master-files/src/libCom/test/O.linux-x86_64/epicsTimeTest.tap'
Parsing TAP test result [/var/lib/jenkins/jobs/epics-base-3.16/builds/105/tap-master-files/src/libCom/test/O.linux-x86_64/epicsTimeTest.tap].
Processing '/var/lib/jenkins/jobs/epics-base-3.16/builds/105/tap-master-files/src/libCom/test/O.linux-x86_64/epicsTimeZoneTest.tap'
Parsing TAP test result [/var/lib/jenkins/jobs/epics-base-3.16/builds/105/tap-master-files/src/libCom/test/O.linux-x86_64/epicsTimeZoneTest.tap].
Processing '/var/lib/jenkins/jobs/epics-base-3.16/builds/105/tap-master-files/src/libCom/test/O.linux-x86_64/epicsTimerTest.tap'
Parsing TAP test result [/var/lib/jenkins/jobs/epics-base-3.16/builds/105/tap-master-files/src/libCom/test/O.linux-x86_64/epicsTimerTest.tap].
Processing '/var/lib/jenkins/jobs/epics-base-3.16/builds/105/tap-master-files/src/libCom/test/O.linux-x86_64/epicsTypesTest.tap'
Parsing TAP test result [/var/lib/jenkins/jobs/epics-base-3.16/builds/105/tap-master-files/src/libCom/test/O.linux-x86_64/epicsTypesTest.tap].
Processing '/var/lib/jenkins/jobs/epics-base-3.16/builds/105/tap-master-files/src/libCom/test/O.linux-x86_64/epicsUnitTestTest.tap'
Parsing TAP test result [/var/lib/jenkins/jobs/epics-base-3.16/builds/105/tap-master-files/src/libCom/test/O.linux-x86_64/epicsUnitTestTest.tap].
Processing '/var/lib/jenkins/jobs/epics-base-3.16/builds/105/tap-master-files/src/libCom/test/O.linux-x86_64/ipAddrToAsciiTest.tap'
Parsing TAP test result [/var/lib/jenkins/jobs/epics-base-3.16/builds/105/tap-master-files/src/libCom/test/O.linux-x86_64/ipAddrToAsciiTest.tap].
Processing '/var/lib/jenkins/jobs/epics-base-3.16/builds/105/tap-master-files/src/libCom/test/O.linux-x86_64/macDefExpandTest.tap'
Parsing TAP test result [/var/lib/jenkins/jobs/epics-base-3.16/builds/105/tap-master-files/src/libCom/test/O.linux-x86_64/macDefExpandTest.tap].
Processing '/var/lib/jenkins/jobs/epics-base-3.16/builds/105/tap-master-files/src/libCom/test/O.linux-x86_64/macLibTest.tap'
Parsing TAP test result [/var/lib/jenkins/jobs/epics-base-3.16/builds/105/tap-master-files/src/libCom/test/O.linux-x86_64/macLibTest.tap].
Processing '/var/lib/jenkins/jobs/epics-base-3.16/builds/105/tap-master-files/src/libCom/test/O.linux-x86_64/ringBytesTest.tap'
Parsing TAP test result [/var/lib/jenkins/jobs/epics-base-3.16/builds/105/tap-master-files/src/libCom/test/O.linux-x86_64/ringBytesTest.tap].
Processing '/var/lib/jenkins/jobs/epics-base-3.16/builds/105/tap-master-files/src/libCom/test/O.linux-x86_64/ringPointerTest.tap'
Parsing TAP test result [/var/lib/jenkins/jobs/epics-base-3.16/builds/105/tap-master-files/src/libCom/test/O.linux-x86_64/ringPointerTest.tap].
Processing '/var/lib/jenkins/jobs/epics-base-3.16/builds/105/tap-master-files/src/libCom/test/O.linux-x86_64/taskwdTest.tap'
Parsing TAP test result [/var/lib/jenkins/jobs/epics-base-3.16/builds/105/tap-master-files/src/libCom/test/O.linux-x86_64/taskwdTest.tap].
Processing '/var/lib/jenkins/jobs/epics-base-3.16/builds/105/tap-master-files/src/std/filters/test/O.linux-x86_64/arrTest.tap'
Parsing TAP test result [/var/lib/jenkins/jobs/epics-base-3.16/builds/105/tap-master-files/src/std/filters/test/O.linux-x86_64/arrTest.tap].
Processing '/var/lib/jenkins/jobs/epics-base-3.16/builds/105/tap-master-files/src/std/filters/test/O.linux-x86_64/dbndTest.tap'
Parsing TAP test result [/var/lib/jenkins/jobs/epics-base-3.16/builds/105/tap-master-files/src/std/filters/test/O.linux-x86_64/dbndTest.tap].
Processing '/var/lib/jenkins/jobs/epics-base-3.16/builds/105/tap-master-files/src/std/filters/test/O.linux-x86_64/syncTest.tap'
Parsing TAP test result [/var/lib/jenkins/jobs/epics-base-3.16/builds/105/tap-master-files/src/std/filters/test/O.linux-x86_64/syncTest.tap].
Processing '/var/lib/jenkins/jobs/epics-base-3.16/builds/105/tap-master-files/src/std/filters/test/O.linux-x86_64/tsTest.tap'
Parsing TAP test result [/var/lib/jenkins/jobs/epics-base-3.16/builds/105/tap-master-files/src/std/filters/test/O.linux-x86_64/tsTest.tap].
Processing '/var/lib/jenkins/jobs/epics-base-3.16/builds/105/tap-master-files/src/std/rec/test/O.linux-x86_64/analogMonitorTest.tap'
Parsing TAP test result [/var/lib/jenkins/jobs/epics-base-3.16/builds/105/tap-master-files/src/std/rec/test/O.linux-x86_64/analogMonitorTest.tap].
Processing '/var/lib/jenkins/jobs/epics-base-3.16/builds/105/tap-master-files/src/std/rec/test/O.linux-x86_64/arrayOpTest.tap'
Parsing TAP test result [/var/lib/jenkins/jobs/epics-base-3.16/builds/105/tap-master-files/src/std/rec/test/O.linux-x86_64/arrayOpTest.tap].
Processing '/var/lib/jenkins/jobs/epics-base-3.16/builds/105/tap-master-files/src/std/rec/test/O.linux-x86_64/asTest.tap'
Parsing TAP test result [/var/lib/jenkins/jobs/epics-base-3.16/builds/105/tap-master-files/src/std/rec/test/O.linux-x86_64/asTest.tap].
Processing '/var/lib/jenkins/jobs/epics-base-3.16/builds/105/tap-master-files/src/std/rec/test/O.linux-x86_64/compressTest.tap'
Parsing TAP test result [/var/lib/jenkins/jobs/epics-base-3.16/builds/105/tap-master-files/src/std/rec/test/O.linux-x86_64/compressTest.tap].
Processing '/var/lib/jenkins/jobs/epics-base-3.16/builds/105/tap-master-files/src/std/rec/test/O.linux-x86_64/linkRetargetLinkTest.tap'
Parsing TAP test result [/var/lib/jenkins/jobs/epics-base-3.16/builds/105/tap-master-files/src/std/rec/test/O.linux-x86_64/linkRetargetLinkTest.tap].
Processing '/var/lib/jenkins/jobs/epics-base-3.16/builds/105/tap-master-files/src/std/rec/test/O.linux-x86_64/regressTest.tap'
Parsing TAP test result [/var/lib/jenkins/jobs/epics-base-3.16/builds/105/tap-master-files/src/std/rec/test/O.linux-x86_64/regressTest.tap].
Processing '/var/lib/jenkins/jobs/epics-base-3.16/builds/105/tap-master-files/src/tools/test/O.linux-x86_64/Breaktable.tap'
Parsing TAP test result [/var/lib/jenkins/jobs/epics-base-3.16/builds/105/tap-master-files/src/tools/test/O.linux-x86_64/Breaktable.tap].
Processing '/var/lib/jenkins/jobs/epics-base-3.16/builds/105/tap-master-files/src/tools/test/O.linux-x86_64/DBD.tap'
Parsing TAP test result [/var/lib/jenkins/jobs/epics-base-3.16/builds/105/tap-master-files/src/tools/test/O.linux-x86_64/DBD.tap].
Processing '/var/lib/jenkins/jobs/epics-base-3.16/builds/105/tap-master-files/src/tools/test/O.linux-x86_64/Device.tap'
Parsing TAP test result [/var/lib/jenkins/jobs/epics-base-3.16/builds/105/tap-master-files/src/tools/test/O.linux-x86_64/Device.tap].
Processing '/var/lib/jenkins/jobs/epics-base-3.16/builds/105/tap-master-files/src/tools/test/O.linux-x86_64/Driver.tap'
Parsing TAP test result [/var/lib/jenkins/jobs/epics-base-3.16/builds/105/tap-master-files/src/tools/test/O.linux-x86_64/Driver.tap].
Processing '/var/lib/jenkins/jobs/epics-base-3.16/builds/105/tap-master-files/src/tools/test/O.linux-x86_64/Function.tap'
Parsing TAP test result [/var/lib/jenkins/jobs/epics-base-3.16/builds/105/tap-master-files/src/tools/test/O.linux-x86_64/Function.tap].
Processing '/var/lib/jenkins/jobs/epics-base-3.16/builds/105/tap-master-files/src/tools/test/O.linux-x86_64/Menu.tap'
Parsing TAP test result [/var/lib/jenkins/jobs/epics-base-3.16/builds/105/tap-master-files/src/tools/test/O.linux-x86_64/Menu.tap].
Processing '/var/lib/jenkins/jobs/epics-base-3.16/builds/105/tap-master-files/src/tools/test/O.linux-x86_64/Recfield.tap'
Parsing TAP test result [/var/lib/jenkins/jobs/epics-base-3.16/builds/105/tap-master-files/src/tools/test/O.linux-x86_64/Recfield.tap].
Processing '/var/lib/jenkins/jobs/epics-base-3.16/builds/105/tap-master-files/src/tools/test/O.linux-x86_64/Recordtype.tap'
Parsing TAP test result [/var/lib/jenkins/jobs/epics-base-3.16/builds/105/tap-master-files/src/tools/test/O.linux-x86_64/Recordtype.tap].
Processing '/var/lib/jenkins/jobs/epics-base-3.16/builds/105/tap-master-files/src/tools/test/O.linux-x86_64/Registrar.tap'
Parsing TAP test result [/var/lib/jenkins/jobs/epics-base-3.16/builds/105/tap-master-files/src/tools/test/O.linux-x86_64/Registrar.tap].
Processing '/var/lib/jenkins/jobs/epics-base-3.16/builds/105/tap-master-files/src/tools/test/O.linux-x86_64/Snippets.tap'
Parsing TAP test result [/var/lib/jenkins/jobs/epics-base-3.16/builds/105/tap-master-files/src/tools/test/O.linux-x86_64/Snippets.tap].
Processing '/var/lib/jenkins/jobs/epics-base-3.16/builds/105/tap-master-files/src/tools/test/O.linux-x86_64/Variable.tap'
Parsing TAP test result [/var/lib/jenkins/jobs/epics-base-3.16/builds/105/tap-master-files/src/tools/test/O.linux-x86_64/Variable.tap].
Processing '/var/lib/jenkins/jobs/epics-base-3.16/builds/105/tap-master-files/src/tools/test/O.linux-x86_64/macLib.tap'
Parsing TAP test result [/var/lib/jenkins/jobs/epics-base-3.16/builds/105/tap-master-files/src/tools/test/O.linux-x86_64/macLib.tap].
TAP Reports Processing: FINISH
[WARNINGS] Skipping publisher since build result is FAILURE
Archiving artifacts

Replies:
Jenkins build is back to normal : epics-base-3.16 #106 APS Jenkins
References:
Build failed in Jenkins: epics-base-3.16 #104 APS Jenkins

Navigate by Date:
Prev: Build failed in Jenkins: epics-base-3.16 #104 APS Jenkins
Next: Jenkins build is back to normal : epics-base-3.16 #106 APS Jenkins
Index: 2002  2003  2004  2005  2006  2007  2008  2009  2010  2011  2012  2013  2014  2015  2016  <2017
Navigate by Thread:
Prev: Build failed in Jenkins: epics-base-3.16 #104 APS Jenkins
Next: Jenkins build is back to normal : epics-base-3.16 #106 APS Jenkins
Index: 2002  2003  2004  2005  2006  2007  2008  2009  2010  2011  2012  2013  2014  2015  2016  <2017
ANJ, 04 May 2017 Valid HTML 4.01! · Home · News · About · Base · Modules · Extensions · Distributions · Download ·
· EPICS V4 · IRMIS · Talk · Bugs · Documents · Links · Licensing ·