Argonne National Laboratory

Experimental Physics and
Industrial Control System

2002  2003  2004  2005  2006  2007  2008  2009  2010  2011  2012  2013  2014  2015  2016  <2017 Index 2002  2003  2004  2005  2006  2007  2008  2009  2010  2011  2012  2013  2014  2015  2016  <2017
<== Date ==> <== Thread ==>

Subject: Build failed in Jenkins: epics-base-3.16-sol #54
From: APS Jenkins <aps-jenkins@anl.gov>
To: core-talk@aps.anl.gov
Date: Mon, 9 Jan 2017 10:14:21 -0600 (CST)
https://jenkins.aps.anl.gov/job/epics-base-3.16-sol/54/------------------------------------------
Started by upstream project "epics-base-3.16" build number 87
originally caused by:
 Started by an SCM change
[EnvInject] - Loading node environment variables.
Building remotely on sol-hera (sol-sparc) in workspace <https://jenkins.aps.anl.gov/job/epics-base-3.16-sol/ws/>
Cleaning workspace...
$ bzr branch bzr+ssh://bazaar.launchpad.net/%2Bbranch/epics-base/3.16/ <https://jenkins.aps.anl.gov/job/epics-base-3.16-sol/ws/>
Branched 12742 revision(s).
Getting local revision...
$ bzr revision-info -d <https://jenkins.aps.anl.gov/job/epics-base-3.16-sol/ws/>
info result: bzr revision-info -d <https://jenkins.aps.anl.gov/job/epics-base-3.16-sol/ws/> returned 0. Command output: "12742 anj@aps.anl.gov-20170106233151-y2pngrzobwt9ha3y
" stderr: ""
RevisionState revno:12742 revid:anj@aps.anl.gov-20170106233151-y2pngrzobwt9ha3y
[epics-base-3.16-sol] $ /bin/sh -xe /var/tmp/hudson2767756591738859384.sh
+ make host 
make -C ./configure install.solaris-sparc 
make[1]: Entering directory `<https://jenkins.aps.anl.gov/job/epics-base-3.16-sol/ws/configure'>
perl -CSD ../src/tools/makeMakefile.pl O.solaris-sparc ../..
mkdir -p O.Common
make -C O.solaris-sparc -f ../Makefile TOP=../.. \
	    T_A=solaris-sparc install
make[2]: Entering directory `<https://jenkins.aps.anl.gov/job/epics-base-3.16-sol/ws/configure/O.solaris-sparc'>
make[2]: Nothing to be done for `install'.
make[2]: Leaving directory `<https://jenkins.aps.anl.gov/job/epics-base-3.16-sol/ws/configure/O.solaris-sparc'>
make[1]: Leaving directory `<https://jenkins.aps.anl.gov/job/epics-base-3.16-sol/ws/configure'>
make -C ./src install.solaris-sparc 
make[1]: Entering directory `<https://jenkins.aps.anl.gov/job/epics-base-3.16-sol/ws/src'>
make -C ./tools install.solaris-sparc 
make[2]: Entering directory `<https://jenkins.aps.anl.gov/job/epics-base-3.16-sol/ws/src/tools'>
perl -CSD ../../src/tools/makeMakefile.pl O.solaris-sparc ../../..
mkdir -p O.Common
make -C O.solaris-sparc -f ../Makefile TOP=../../.. \
	    T_A=solaris-sparc install
make[3]: Entering directory `<https://jenkins.aps.anl.gov/job/epics-base-3.16-sol/ws/src/tools/O.solaris-sparc'>
Installing PERL_MODULES file ../../../lib/perl/EPICS/Copy.pm
mkdir ../../../lib
mkdir ../../../lib/perl
mkdir ../../../lib/perl/EPICS
Installing PERL_MODULES file ../../../lib/perl/EPICS/Path.pm
Installing PERL_MODULES file ../../../lib/perl/EPICS/Release.pm
Installing PERL_MODULES file ../../../lib/perl/EPICS/Readfile.pm
Installing PERL_MODULES file ../../../lib/perl/EPICS/Getopts.pm
Installing PERL_MODULES file ../../../lib/perl/EPICS/macLib.pm
Installing PERL_MODULES file ../../../lib/perl/DBD.pm
Installing PERL_MODULES file ../../../lib/perl/DBD/Base.pm
mkdir ../../../lib/perl/DBD
Installing PERL_MODULES file ../../../lib/perl/DBD/Breaktable.pm
Installing PERL_MODULES file ../../../lib/perl/DBD/Device.pm
Installing PERL_MODULES file ../../../lib/perl/DBD/Driver.pm
Installing PERL_MODULES file ../../../lib/perl/DBD/Function.pm
Installing PERL_MODULES file ../../../lib/perl/DBD/Menu.pm
Installing PERL_MODULES file ../../../lib/perl/DBD/Output.pm
Installing PERL_MODULES file ../../../lib/perl/DBD/Parser.pm
Installing PERL_MODULES file ../../../lib/perl/DBD/Recfield.pm
Installing PERL_MODULES file ../../../lib/perl/DBD/Recordtype.pm
Installing PERL_MODULES file ../../../lib/perl/DBD/Record.pm
Installing PERL_MODULES file ../../../lib/perl/DBD/Registrar.pm
Installing PERL_MODULES file ../../../lib/perl/DBD/Variable.pm
Expanding epics-base-solaris-sparc.pc@ to epics-base-solaris-sparc.pc
Installing PKGCONFIG file ../../../lib/pkgconfig/epics-base-solaris-sparc.pc
mkdir ../../../lib/pkgconfig
Expanding ../epics-base.pc@ to epics-base.pc
Installing PKGCONFIG file ../../../lib/pkgconfig/epics-base.pc
Installing created executable ../../../bin/solaris-sparc/assembleSnippets.pl
mkdir ../../../bin
mkdir ../../../bin/solaris-sparc
Installing created executable ../../../bin/solaris-sparc/convertRelease.pl
Installing created executable ../../../bin/solaris-sparc/cvsclean.pl
Installing created executable ../../../bin/solaris-sparc/dos2unix.pl
Installing created executable ../../../bin/solaris-sparc/expandVars.pl
Installing created executable ../../../bin/solaris-sparc/fullPathName.pl
Installing created executable ../../../bin/solaris-sparc/installEpics.pl
Installing created executable ../../../bin/solaris-sparc/makeIncludeDbd.pl
Installing created executable ../../../bin/solaris-sparc/makeMakefile.pl
Installing created executable ../../../bin/solaris-sparc/makeTestfile.pl
Installing created executable ../../../bin/solaris-sparc/mkmf.pl
Installing created executable ../../../bin/solaris-sparc/munch.pl
Installing created executable ../../../bin/solaris-sparc/replaceVAR.pl
Installing created executable ../../../bin/solaris-sparc/useManifestTool.pl
Installing created executable ../../../bin/solaris-sparc/genVersionHeader.pl
Installing created executable ../../../bin/solaris-sparc/dbdToMenuH.pl
Installing created executable ../../../bin/solaris-sparc/dbdToRecordtypeH.pl
Installing created executable ../../../bin/solaris-sparc/dbdExpand.pl
Installing created executable ../../../bin/solaris-sparc/dbExpand.pl
Installing created executable ../../../bin/solaris-sparc/dbdToHtml.pl
Installing created executable ../../../bin/solaris-sparc/podToHtml.pl
Installing created executable ../../../bin/solaris-sparc/podRemove.pl
Installing created executable ../../../bin/solaris-sparc/registerRecordDeviceDriver.pl
Installing html ../../../html/./style.css
mkdir ../../../html
mkdir ../../../html/.
perl -CSD ../../../src/tools/podToHtml.pl -s -o Getopts.html ../EPICS/Getopts.pm
Can't locate Pod/Simple/HTML.pm in @INC (@INC contains: /usr/perl5/5.8.4/lib/sun4-solaris-64int /usr/perl5/5.8.4/lib /usr/perl5/site_perl/5.8.4/sun4-solaris-64int /usr/perl5/site_perl/5.8.4 /usr/perl5/site_perl /usr/perl5/vendor_perl/5.8.4/sun4-solaris-64int /usr/perl5/vendor_perl/5.8.4 /usr/perl5/vendor_perl .) at ../../../src/tools/podToHtml.pl line 15.
BEGIN failed--compilation aborted at ../../../src/tools/podToHtml.pl line 15.
make[3]: *** [../O.Common/EPICS/Getopts.html] Error 2
make[3]: Leaving directory `<https://jenkins.aps.anl.gov/job/epics-base-3.16-sol/ws/src/tools/O.solaris-sparc'>
make[2]: *** [install.solaris-sparc] Error 2
make[2]: Leaving directory `<https://jenkins.aps.anl.gov/job/epics-base-3.16-sol/ws/src/tools'>
make[1]: *** [tools.install.solaris-sparc] Error 2
make[1]: Leaving directory `<https://jenkins.aps.anl.gov/job/epics-base-3.16-sol/ws/src'>
make: *** [src.install.solaris-sparc] Error 2
Build step 'Execute shell' marked build as failure
[WARNINGS] Skipping publisher since build result is FAILURE

Replies:
Jenkins build is back to normal : epics-base-3.16-sol #55 APS Jenkins

Navigate by Date:
Prev: Jenkins build is back to normal : epics-base-3.15-win64-test #93 APS Jenkins
Next: Build failed in Jenkins: epics-base-3.15-sol #67 APS Jenkins
Index: 2002  2003  2004  2005  2006  2007  2008  2009  2010  2011  2012  2013  2014  2015  2016  <2017
Navigate by Thread:
Prev: Jenkins build is back to normal : epics-base-3.15-win64-test #93 APS Jenkins
Next: Jenkins build is back to normal : epics-base-3.16-sol #55 APS Jenkins
Index: 2002  2003  2004  2005  2006  2007  2008  2009  2010  2011  2012  2013  2014  2015  2016  <2017
ANJ, 09 Jan 2017 Valid HTML 4.01! · Home · News · About · Base · Modules · Extensions · Distributions · Download ·
· EPICS V4 · IRMIS · Talk · Bugs · Documents · Links · Licensing ·