Argonne National Laboratory

Experimental Physics and
Industrial Control System

2002  2003  2004  2005  2006  2007  2008  2009  2010  2011  2012  2013  2014  <20152016  2017  Index 2002  2003  2004  2005  2006  2007  2008  2009  2010  2011  2012  2013  2014  <20152016  2017 
<== Date ==> <== Thread ==>

Subject: Build failed in Jenkins: epics-base-3.14-ios #1
From: APS Jenkins <aps-jenkins@anl.gov>
To: core-talk@aps.anl.gov
Date: Wed, 4 Feb 2015 09:57:31 -0600 (CST)
See <https://jenkins.aps.anl.gov/job/epics-base-3.14-ios/1/>

------------------------------------------
Started by user Andrew Johnson
[EnvInject] - Loading node environment variables.
Building remotely on mac-1 (mac) in workspace <https://jenkins.aps.anl.gov/job/epics-base-3.14-ios/ws/>
[epics-base-3.14-mac] $ /bin/sh -xe /var/folders/6f/2q91ldsx2rncqbx80st_4r700000gn/T/hudson624950361330618889.sh
+ make ios-arm
/Applications/Xcode.app/Contents/Developer/usr/bin/make -C ./configure ios-arm 
perl ../src/tools/makeMakefile.pl O.ios-arm ../..
/Applications/Xcode.app/Contents/Developer/usr/bin/make -C O.darwin-x86 -f ../Makefile TOP=../.. T_A=darwin-x86
make[2]: Nothing to be done for `all'.
/Applications/Xcode.app/Contents/Developer/usr/bin/make -C O.ios-arm -f ../Makefile TOP=../.. T_A=ios-arm
make[2]: Nothing to be done for `all'.
/Applications/Xcode.app/Contents/Developer/usr/bin/make -C ./src ios-arm 
/Applications/Xcode.app/Contents/Developer/usr/bin/make -C ./tools ios-arm 
perl ../../src/tools/makeMakefile.pl O.ios-arm ../../..
/Applications/Xcode.app/Contents/Developer/usr/bin/make -C O.darwin-x86 -f ../Makefile TOP=../../.. T_A=darwin-x86
make[3]: Nothing to be done for `all'.
/Applications/Xcode.app/Contents/Developer/usr/bin/make -C O.ios-arm -f ../Makefile TOP=../../.. T_A=ios-arm
make[3]: Nothing to be done for `all'.
/Applications/Xcode.app/Contents/Developer/usr/bin/make -C ./makeBaseApp ios-arm 
perl ../../bin/darwin-x86/makeMakefile.pl O.ios-arm ../../..
/Applications/Xcode.app/Contents/Developer/usr/bin/make -C O.darwin-x86 -f ../Makefile TOP=../../.. T_A=darwin-x86
make[3]: Nothing to be done for `all'.
/Applications/Xcode.app/Contents/Developer/usr/bin/make -C O.ios-arm -f ../Makefile TOP=../../.. T_A=ios-arm
make[3]: Nothing to be done for `all'.
/Applications/Xcode.app/Contents/Developer/usr/bin/make -C ./makeBaseExt ios-arm 
perl ../../bin/darwin-x86/makeMakefile.pl O.ios-arm ../../..
/Applications/Xcode.app/Contents/Developer/usr/bin/make -C O.darwin-x86 -f ../Makefile TOP=../../.. T_A=darwin-x86
make[3]: Nothing to be done for `all'.
/Applications/Xcode.app/Contents/Developer/usr/bin/make -C O.ios-arm -f ../Makefile TOP=../../.. T_A=ios-arm
make[3]: Nothing to be done for `all'.
/Applications/Xcode.app/Contents/Developer/usr/bin/make -C ./libCom ios-arm 
perl ../../bin/darwin-x86/makeMakefile.pl O.ios-arm ../../..
/Applications/Xcode.app/Contents/Developer/usr/bin/make -C O.darwin-x86 -f ../Makefile TOP=../../.. T_A=darwin-x86
make[3]: Nothing to be done for `all'.
/Applications/Xcode.app/Contents/Developer/usr/bin/make -C O.ios-arm -f ../Makefile TOP=../../.. T_A=ios-arm
Installing generic include file ../../../include/os/iOS/osiFileName.h
mkdir ../../../include/os/iOS
Installing generic include file ../../../include/os/iOS/osdSock.h
Installing os dependent include file ../../../include/os/iOS/osdInterrupt.h
Installing os dependent include file ../../../include/os/iOS/osdMutex.h
Installing os dependent include file ../../../include/os/iOS/osdEvent.h
Installing generic include file ../../../include/os/iOS/epicsMath.h
Installing os dependent include file ../../../include/os/iOS/osdMessageQueue.h
Installing os dependent include file ../../../include/os/iOS/osdStrtod.h
Installing os dependent include file ../../../include/os/iOS/osdPoolStatus.h
Installing os dependent include file ../../../include/os/iOS/osdThread.h
Installing generic include file ../../../include/os/iOS/osdTime.h
Installing os dependent include file ../../../include/os/iOS/osiUnistd.h
Installing os dependent include file ../../../include/os/iOS/osdWireFormat.h
Installing os dependent include file ../../../include/os/iOS/osdWireConfig.h
Installing os dependent include file ../../../include/os/iOS/epicsReadline.h
Installing os dependent include file ../../../include/os/iOS/epicsGetopt.h
Installing os dependent include file ../../../include/os/iOS/osdVME.h
/Applications/Xcode.app/Contents/Developer/Toolchains/XcodeDefault.xctoolchain/usr/bin/clang -c              -DUNIX      -O3 -g   -Wall      -arch armv7 -arch armv7s -arch arm64 -fno-common -Wno-unused-value   -fno-inline-functions -miphoneos-version-min=7.0 -isysroot /Applications/Xcode.app/Contents/Developer/Platforms/iPhoneOS.platform/Developer/SDKs/iPhoneOS7.0.sdk -fPIC  -I. -I../O.Common -I. -I../../../src/libCom/osi/os/iOS -I../../../src/libCom/osi/os/posix -I../../../src/libCom/osi/os/default -I.. -I../../../src/libCom/bucketLib -I../../../src/libCom/ring -I../../../src/libCom/calc -I../../../src/libCom/cvtFast -I../../../src/libCom/cppStd -I../../../src/libCom/cxxTemplates -I../../../src/libCom/dbmf -I../../../src/libCom/ellLib -I../../../src/libCom/env -I../../../src/libCom/error -I../../../src/libCom/fdmgr -I../../../src/libCom/freeList -I../../../src/libCom/gpHash -I../../../src/libCom/iocsh -I../../../src/libCom/logClient -I../../../src/libCom/macLib -I../../../s!
 rc/libCom/misc -I../../../src/libCom/osi -I../../../src/libCom/taskwd -I../../../src/libCom/timer -I../../../src/libCom/tsDefs -I../../../include/os/iOS -I../../../include        ../../../src/libCom/bucketLib/bucketLib.c 
clang: warning: no such sysroot directory: '/Applications/Xcode.app/Contents/Developer/Platforms/iPhoneOS.platform/Developer/SDKs/iPhoneOS7.0.sdk'
clang: warning: no such sysroot directory: '/Applications/Xcode.app/Contents/Developer/Platforms/iPhoneOS.platform/Developer/SDKs/iPhoneOS7.0.sdk'
clang: warning: no such sysroot directory: '/Applications/Xcode.app/Contents/Developer/Platforms/iPhoneOS.platform/Developer/SDKs/iPhoneOS7.0.sdk'
../../../src/libCom/bucketLib/bucketLib.c:19:10: fatal error: 'stdio.h' file not found
#include <stdio.h>
         ^
1 error generated.
make[3]: *** [bucketLib.o] Error 1
make[2]: *** [ios-arm] Error 2
make[1]: *** [libCom.ios-arm] Error 2
make: *** [src.ios-arm] Error 2
Build step 'Execute shell' marked build as failure
[WARNINGS] Skipping publisher since build result is FAILURE


Replies:
Jenkins build is back to normal : epics-base-3.14-ios #2 APS Jenkins

Navigate by Date:
Prev: Re: Jenkins build became unstable: epics-base-3.15-win64 #142 Johnson, Andrew N.
Next: Jenkins build is back to normal : epics-base-3.14-ios #2 APS Jenkins
Index: 2002  2003  2004  2005  2006  2007  2008  2009  2010  2011  2012  2013  2014  <20152016  2017 
Navigate by Thread:
Prev: Jenkins build became unstable: epics-base-3.15-win32s #121 APS Jenkins
Next: Jenkins build is back to normal : epics-base-3.14-ios #2 APS Jenkins
Index: 2002  2003  2004  2005  2006  2007  2008  2009  2010  2011  2012  2013  2014  <20152016  2017 
ANJ, 16 Dec 2015 Valid HTML 4.01! · Home · News · About · Base · Modules · Extensions · Distributions · Download ·
· EPICS V4 · IRMIS · Talk · Bugs · Documents · Links · Licensing ·