Argonne National Laboratory

Experimental Physics and
Industrial Control System

2002  2003  2004  2005  2006  2007  2008  2009  2010  2011  2012  2013  2014  <20152016  2017  Index 2002  2003  2004  2005  2006  2007  2008  2009  2010  2011  2012  2013  2014  <20152016  2017 
<== Date ==> <== Thread ==>

Subject: Build failed in Jenkins: epics-base-3.14-mac #1
From: APS Jenkins <aps-jenkins@anl.gov>
To: core-talk@aps.anl.gov
Date: Tue, 3 Feb 2015 17:08:42 -0600 (CST)
See <https://jenkins.aps.anl.gov/job/epics-base-3.14-mac/1/>

------------------------------------------
Started by user Andrew Johnson
[EnvInject] - Loading node environment variables.
Building remotely on mac-1 (mac) in workspace <https://jenkins.aps.anl.gov/job/epics-base-3.14-mac/ws/>
Cleaning workspace...
$ bzr branch bzr+ssh://bazaar.launchpad.net/%2Bbranch/epics-base/3.14/ <https://jenkins.aps.anl.gov/job/epics-base-3.14-mac/ws/>
ERROR: Failed to branch bzr+ssh://bazaar.launchpad.net/%2Bbranch/epics-base/3.14/
java.io.IOException: Cannot run program "bzr": error=2, No such file or directory
	at java.lang.ProcessBuilder.processException(ProcessBuilder.java:478)
	at java.lang.ProcessBuilder.start(ProcessBuilder.java:457)
	at hudson.Proc$LocalProc.<init>(Proc.java:244)
	at hudson.Proc$LocalProc.<init>(Proc.java:216)
	at hudson.Launcher$LocalLauncher.launch(Launcher.java:773)
	at hudson.Launcher$ProcStarter.start(Launcher.java:353)
	at hudson.Launcher$RemoteLaunchCallable.call(Launcher.java:998)
	at hudson.Launcher$RemoteLaunchCallable.call(Launcher.java:965)
	at hudson.remoting.UserRequest.perform(UserRequest.java:118)
	at hudson.remoting.UserRequest.perform(UserRequest.java:48)
	at hudson.remoting.Request$2.run(Request.java:328)
	at hudson.remoting.InterceptingExecutorService$1.call(InterceptingExecutorService.java:72)
	at java.util.concurrent.FutureTask$Sync.innerRun(FutureTask.java:303)
	at java.util.concurrent.FutureTask.run(FutureTask.java:138)
	at java.util.concurrent.ThreadPoolExecutor$Worker.runTask(ThreadPoolExecutor.java:895)
	at java.util.concurrent.ThreadPoolExecutor$Worker.run(ThreadPoolExecutor.java:918)
	at java.lang.Thread.run(Thread.java:695)
Caused by: java.io.IOException: error=2, No such file or directory
	at java.lang.UNIXProcess.forkAndExec(Native Method)
	at java.lang.UNIXProcess.<init>(UNIXProcess.java:53)
	at java.lang.ProcessImpl.start(ProcessImpl.java:91)
	at java.lang.ProcessBuilder.start(ProcessBuilder.java:452)
	... 15 more
[WARNINGS] Skipping publisher since build result is FAILURE

Navigate by Date:
Prev: Re: Generated documentation inside Base Andrew Johnson
Next: Jenkins build is unstable: epics-base-3.15-mac #1 APS Jenkins
Index: 2002  2003  2004  2005  2006  2007  2008  2009  2010  2011  2012  2013  2014  <20152016  2017 
Navigate by Thread:
Prev: Re: Generated documentation inside Base Andrew Johnson
Next: Jenkins build is unstable: epics-base-3.15-mac #1 APS Jenkins
Index: 2002  2003  2004  2005  2006  2007  2008  2009  2010  2011  2012  2013  2014  <20152016  2017 
ANJ, 16 Dec 2015 Valid HTML 4.01! · Home · News · About · Base · Modules · Extensions · Distributions · Download ·
· EPICS V4 · IRMIS · Talk · Bugs · Documents · Links · Licensing ·