Argonne National Laboratory

Experimental Physics and
Industrial Control System

2002  2003  2004  2005  2006  2007  2008  2009  2010  2011  2012  2013  <20142015  2016  2017  Index 2002  2003  2004  2005  2006  2007  2008  2009  2010  2011  2012  2013  <20142015  2016  2017 
<== Date ==> <== Thread ==>

Subject: Build failed in Jenkins: epics-base-3.15-win32s #3
From: APS Jenkins <aps-jenkins@anl.gov>
To: core-talk@aps.anl.gov
Date: Tue, 1 Apr 2014 12:11:21 -0500 (CDT)
See <https://jenkins.aps.anl.gov/job/epics-base-3.15-win32s/3/>

------------------------------------------
Started by upstream project "epics-base-3.15-win32" build number 11
originally caused by:
 Started by upstream project "epics-base-3.15" build number 48
 originally caused by:
  Started by an SCM change
[EnvInject] - Loading node environment variables.
Building remotely on win32-1 (win32) in workspace <https://jenkins.aps.anl.gov/job/epics-base-3.15-win32s/ws/>
[epics-base-3.15-win32] $ cmd /c call C:\windows\TEMP\hudson4229625252601171297.bat

<https://jenkins.aps.anl.gov/job/epics-base-3.15-win32s/ws/>make> CROSS_COMPILER_TARGET_ARCHS=win32-x86-static win32-x86-static 
make -C ./configure win32-x86-static 
make[1]: Entering directory `C:/jenkins/win32-1/workspace/epics-base-3.15-win32/configure'
make -C O.win32-x86 -f ../Makefile TOP=../.. T_A=win32-x86
make[2]: Entering directory `C:/jenkins/win32-1/workspace/epics-base-3.15-win32/configure/O.win32-x86'
make[2]: Nothing to be done for `all'.
make[2]: Leaving directory `C:/jenkins/win32-1/workspace/epics-base-3.15-win32/configure/O.win32-x86'
make -C O.win32-x86-static -f ../Makefile TOP=../.. T_A=win32-x86-static
make[2]: Entering directory `C:/jenkins/win32-1/workspace/epics-base-3.15-win32/configure/O.win32-x86-static'
make[2]: Nothing to be done for `all'.
make[2]: Leaving directory `C:/jenkins/win32-1/workspace/epics-base-3.15-win32/configure/O.win32-x86-static'
make[1]: Leaving directory `C:/jenkins/win32-1/workspace/epics-base-3.15-win32/configure'
make -C ./src win32-x86-static 
make[1]: Entering directory `C:/jenkins/win32-1/workspace/epics-base-3.15-win32/src'
make -C ./tools win32-x86-static 
make[2]: Entering directory `C:/jenkins/win32-1/workspace/epics-base-3.15-win32/src/tools'
make -C O.win32-x86 -f ../Makefile TOP=../../.. T_A=win32-x86
make[3]: Entering directory `C:/jenkins/win32-1/workspace/epics-base-3.15-win32/src/tools/O.win32-x86'
make[3]: Nothing to be done for `all'.
make[3]: Leaving directory `C:/jenkins/win32-1/workspace/epics-base-3.15-win32/src/tools/O.win32-x86'
make -C O.win32-x86-static -f ../Makefile TOP=../../.. T_A=win32-x86-static
make[3]: Entering directory `C:/jenkins/win32-1/workspace/epics-base-3.15-win32/src/tools/O.win32-x86-static'
mkdir ../../../bin/win32-x86-static
make[3]: Leaving directory `C:/jenkins/win32-1/workspace/epics-base-3.15-win32/src/tools/O.win32-x86-static'
make[2]: Leaving directory `C:/jenkins/win32-1/workspace/epics-base-3.15-win32/src/tools'
make -C tools/test win32-x86-static 
make[2]: Entering directory `C:/jenkins/win32-1/workspace/epics-base-3.15-win32/src/tools/test'
make -C O.win32-x86 -f ../Makefile TOP=../../../.. T_A=win32-x86
make[3]: Entering directory `C:/jenkins/win32-1/workspace/epics-base-3.15-win32/src/tools/test/O.win32-x86'
make[3]: Nothing to be done for `all'.
make[3]: Leaving directory `C:/jenkins/win32-1/workspace/epics-base-3.15-win32/src/tools/test/O.win32-x86'
make -C O.win32-x86-static -f ../Makefile TOP=../../../.. T_A=win32-x86-static
make[3]: Entering directory `C:/jenkins/win32-1/workspace/epics-base-3.15-win32/src/tools/test/O.win32-x86-static'
make[3]: Nothing to be done for `all'.
make[3]: Leaving directory `C:/jenkins/win32-1/workspace/epics-base-3.15-win32/src/tools/test/O.win32-x86-static'
make[2]: Leaving directory `C:/jenkins/win32-1/workspace/epics-base-3.15-win32/src/tools/test'
make -C template/base win32-x86-static 
make[2]: Entering directory `C:/jenkins/win32-1/workspace/epics-base-3.15-win32/src/template/base'
make -C O.win32-x86 -f ../Makefile TOP=../../../.. T_A=win32-x86
make[3]: Entering directory `C:/jenkins/win32-1/workspace/epics-base-3.15-win32/src/template/base/O.win32-x86'
make[3]: Nothing to be done for `all'.
make[3]: Leaving directory `C:/jenkins/win32-1/workspace/epics-base-3.15-win32/src/template/base/O.win32-x86'
make -C O.win32-x86-static -f ../Makefile TOP=../../../.. T_A=win32-x86-static
make[3]: Entering directory `C:/jenkins/win32-1/workspace/epics-base-3.15-win32/src/template/base/O.win32-x86-static'
make[3]: Leaving directory `C:/jenkins/win32-1/workspace/epics-base-3.15-win32/src/template/base/O.win32-x86-static'
make[2]: Leaving directory `C:/jenkins/win32-1/workspace/epics-base-3.15-win32/src/template/base'
make -C template/ext win32-x86-static 
make[2]: Entering directory `C:/jenkins/win32-1/workspace/epics-base-3.15-win32/src/template/ext'
make -C O.win32-x86 -f ../Makefile TOP=../../../.. T_A=win32-x86
make[3]: Entering directory `C:/jenkins/win32-1/workspace/epics-base-3.15-win32/src/template/ext/O.win32-x86'
make[3]: Nothing to be done for `all'.
make[3]: Leaving directory `C:/jenkins/win32-1/workspace/epics-base-3.15-win32/src/template/ext/O.win32-x86'
make -C O.win32-x86-static -f ../Makefile TOP=../../../.. T_A=win32-x86-static
make[3]: Entering directory `C:/jenkins/win32-1/workspace/epics-base-3.15-win32/src/template/ext/O.win32-x86-static'
make[3]: Leaving directory `C:/jenkins/win32-1/workspace/epics-base-3.15-win32/src/template/ext/O.win32-x86-static'
make[2]: Leaving directory `C:/jenkins/win32-1/workspace/epics-base-3.15-win32/src/template/ext'
make -C ./libCom win32-x86-static 
make[2]: Entering directory `C:/jenkins/win32-1/workspace/epics-base-3.15-win32/src/libCom'
make -C O.win32-x86 -f ../Makefile TOP=../../.. T_A=win32-x86
make[3]: Entering directory `C:/jenkins/win32-1/workspace/epics-base-3.15-win32/src/libCom/O.win32-x86'
perl -CSD ../../../bin/win32-x86/mkmf.pl  -m epicsGeneralTime.d . ../O.Common . ../../../src/libCom/osi/compiler/msvc ../../../src/libCom/osi/compiler/default . ../../../src/libCom/osi/os/WIN32 ../../../src/libCom/osi/os/default .. ../../../src/libCom/as ../../../src/libCom/bucketLib ../../../src/libCom/calc ../../../src/libCom/cvtFast ../../../src/libCom/cppStd ../../../src/libCom/cxxTemplates ../../../src/libCom/dbmf ../../../src/libCom/ellLib ../../../src/libCom/env ../../../src/libCom/error ../../../src/libCom/fdmgr ../../../src/libCom/flex ../../../src/libCom/freeList ../../../src/libCom/gpHash ../../../src/libCom/iocsh ../../../src/libCom/log ../../../src/libCom/macLib ../../../src/libCom/misc ../../../src/libCom/osi ../../../src/libCom/ring ../../../src/libCom/taskwd ../../../src/libCom/timer ../../../src/libCom/yacc ../../../src/libCom/yacc ../../../src/libCom/yajl ../../../include/compiler/msvc ../../../include/os/WIN32 ../../../include        epicsGeneralTime.d ../!
 ../../src/libCom/osi/epicsGeneralTime.c
ERROR opening file epicsGeneralTime.d for writing: Invalid argument
perl -CSD ../../../bin/win32-x86/mkmf.pl  -m epicsMath.d . ../O.Common . ../../../src/libCom/osi/compiler/msvc ../../../src/libCom/osi/compiler/default . ../../../src/libCom/osi/os/WIN32 ../../../src/libCom/osi/os/default .. ../../../src/libCom/as ../../../src/libCom/bucketLib ../../../src/libCom/calc ../../../src/libCom/cvtFast ../../../src/libCom/cppStd ../../../src/libCom/cxxTemplates ../../../src/libCom/dbmf ../../../src/libCom/ellLib ../../../src/libCom/env ../../../src/libCom/error ../../../src/libCom/fdmgr ../../../src/libCom/flex ../../../src/libCom/freeList ../../../src/libCom/gpHash ../../../src/libCom/iocsh ../../../src/libCom/log ../../../src/libCom/macLib ../../../src/libCom/misc ../../../src/libCom/osi ../../../src/libCom/ring ../../../src/libCom/taskwd ../../../src/libCom/timer ../../../src/libCom/yacc ../../../src/libCom/yacc ../../../src/libCom/yajl ../../../include/compiler/msvc ../../../include/os/WIN32 ../../../include        epicsMath.d ../../../src/libC!
 om/osi/epicsMath.cpp
ERROR opening file epicsMath.d for writing: Invalid argument
perl -CSD ../../../bin/win32-x86/mkmf.pl  -m epicsEvent.d . ../O.Common . ../../../src/libCom/osi/compiler/msvc ../../../src/libCom/osi/compiler/default . ../../../src/libCom/osi/os/WIN32 ../../../src/libCom/osi/os/default .. ../../../src/libCom/as ../../../src/libCom/bucketLib ../../../src/libCom/calc ../../../src/libCom/cvtFast ../../../src/libCom/cppStd ../../../src/libCom/cxxTemplates ../../../src/libCom/dbmf ../../../src/libCom/ellLib ../../../src/libCom/env ../../../src/libCom/error ../../../src/libCom/fdmgr ../../../src/libCom/flex ../../../src/libCom/freeList ../../../src/libCom/gpHash ../../../src/libCom/iocsh ../../../src/libCom/log ../../../src/libCom/macLib ../../../src/libCom/misc ../../../src/libCom/osi ../../../src/libCom/ring ../../../src/libCom/taskwd ../../../src/libCom/timer ../../../src/libCom/yacc ../../../src/libCom/yacc ../../../src/libCom/yajl ../../../include/compiler/msvc ../../../include/os/WIN32 ../../../include        epicsEvent.d ../../../src/li!
 bCom/osi/epicsEvent.cpp
ERROR opening file epicsEvent.d for writing: Invalid argument
perl -CSD ../../../bin/win32-x86/mkmf.pl  -m epicsExit.d . ../O.Common . ../../../src/libCom/osi/compiler/msvc ../../../src/libCom/osi/compiler/default . ../../../src/libCom/osi/os/WIN32 ../../../src/libCom/osi/os/default .. ../../../src/libCom/as ../../../src/libCom/bucketLib ../../../src/libCom/calc ../../../src/libCom/cvtFast ../../../src/libCom/cppStd ../../../src/libCom/cxxTemplates ../../../src/libCom/dbmf ../../../src/libCom/ellLib ../../../src/libCom/env ../../../src/libCom/error ../../../src/libCom/fdmgr ../../../src/libCom/flex ../../../src/libCom/freeList ../../../src/libCom/gpHash ../../../src/libCom/iocsh ../../../src/libCom/log ../../../src/libCom/macLib ../../../src/libCom/misc ../../../src/libCom/osi ../../../src/libCom/ring ../../../src/libCom/taskwd ../../../src/libCom/timer ../../../src/libCom/yacc ../../../src/libCom/yacc ../../../src/libCom/yajl ../../../include/compiler/msvc ../../../include/os/WIN32 ../../../include        epicsExit.d ../../../src/libC!
 om/misc/epicsExit.c
ERROR opening file epicsExit.d for writing: Invalid argument
perl -CSD ../../../bin/win32-x86/mkmf.pl  -m epicsConvert.d . ../O.Common . ../../../src/libCom/osi/compiler/msvc ../../../src/libCom/osi/compiler/default . ../../../src/libCom/osi/os/WIN32 ../../../src/libCom/osi/os/default .. ../../../src/libCom/as ../../../src/libCom/bucketLib ../../../src/libCom/calc ../../../src/libCom/cvtFast ../../../src/libCom/cppStd ../../../src/libCom/cxxTemplates ../../../src/libCom/dbmf ../../../src/libCom/ellLib ../../../src/libCom/env ../../../src/libCom/error ../../../src/libCom/fdmgr ../../../src/libCom/flex ../../../src/libCom/freeList ../../../src/libCom/gpHash ../../../src/libCom/iocsh ../../../src/libCom/log ../../../src/libCom/macLib ../../../src/libCom/misc ../../../src/libCom/osi ../../../src/libCom/ring ../../../src/libCom/taskwd ../../../src/libCom/timer ../../../src/libCom/yacc ../../../src/libCom/yacc ../../../src/libCom/yajl ../../../include/compiler/msvc ../../../include/os/WIN32 ../../../include        epicsConvert.d ../../../sr!
 c/libCom/misc/epicsConvert.c
ERROR opening file epicsConvert.d for writing: Invalid argument
cl               -nologo -D__STDC__=0 -D_CRT_SECURE_NO_DEPRECATE -D_CRT_NONSTDC_NO_DEPRECATE   -Ox -GL   -W3 -w44355       -MD -DEPICS_BUILD_DLL -DEPICS_CALL_DLL   -I. -I../O.Common -I. -I../../../src/libCom/osi/compiler/msvc -I../../../src/libCom/osi/compiler/default -I. -I../../../src/libCom/osi/os/WIN32 -I../../../src/libCom/osi/os/default -I.. -I../../../src/libCom/as -I../../../src/libCom/bucketLib -I../../../src/libCom/calc -I../../../src/libCom/cvtFast -I../../../src/libCom/cppStd -I../../../src/libCom/cxxTemplates -I../../../src/libCom/dbmf -I../../../src/libCom/ellLib -I../../../src/libCom/env -I../../../src/libCom/error -I../../../src/libCom/fdmgr -I../../../src/libCom/flex -I../../../src/libCom/freeList -I../../../src/libCom/gpHash -I../../../src/libCom/iocsh -I../../../src/libCom/log -I../../../src/libCom/macLib -I../../../src/libCom/misc -I../../../src/libCom/osi -I../../../src/libCom/ring -I../../../src/libCom/taskwd -I../../../src/libCom/timer -I../../../src/l!
 ibCom/yacc -I../../../src/libCom/yacc -I../../../src/libCom/yajl -I../../../include/compiler/msvc -I../../../include/os/WIN32 -I../../../include        -c ../../../src/libCom/misc/epicsConvert.c
epicsConvert.c
<https://jenkins.aps.anl.gov/job/epics-base-3.15-win32s/ws/src\libCom\misc\epicsConvert.c> : fatal error C1083: Cannot open compiler generated file: 'epicsConvert.obj': Invalid argument
make[3]: *** [epicsConvert.obj] Error 1
make[3]: Leaving directory `C:/jenkins/win32-1/workspace/epics-base-3.15-win32/src/libCom/O.win32-x86'
make[2]: *** [win32-x86] Error 2
make[2]: Leaving directory `C:/jenkins/win32-1/workspace/epics-base-3.15-win32/src/libCom'
make[1]: *** [libCom.win32-x86-static] Error 2
make[1]: Leaving directory `C:/jenkins/win32-1/workspace/epics-base-3.15-win32/src'
make: *** [src.win32-x86-static] Error 2

<https://jenkins.aps.anl.gov/job/epics-base-3.15-win32s/ws/>exit> 2 
Build step 'Execute Windows batch command' marked build as failure
[WARNINGS] Skipping publisher since build result is FAILURE


Replies:
Jenkins build is back to normal : epics-base-3.15-win32s #4 APS Jenkins

Navigate by Date:
Prev: Build failed in Jenkins: epics-base-3.15-win32 #11 APS Jenkins
Next: Jenkins build is back to normal : epics-base-3.15-win32 #12 APS Jenkins
Index: 2002  2003  2004  2005  2006  2007  2008  2009  2010  2011  2012  2013  <20142015  2016  2017 
Navigate by Thread:
Prev: Jenkins build is back to normal : epics-base-3.15-win32 #12 APS Jenkins
Next: Jenkins build is back to normal : epics-base-3.15-win32s #4 APS Jenkins
Index: 2002  2003  2004  2005  2006  2007  2008  2009  2010  2011  2012  2013  <20142015  2016  2017 
ANJ, 16 May 2014 Valid HTML 4.01! · Home · News · About · Base · Modules · Extensions · Distributions · Download ·
· EPICS V4 · IRMIS · Talk · Bugs · Documents · Links · Licensing ·