Argonne National Laboratory

Experimental Physics and
Industrial Control System

2002  2003  2004  2005  2006  2007  2008  2009  2010  2011  2012  2013  <20142015  2016  2017  Index 2002  2003  2004  2005  2006  2007  2008  2009  2010  2011  2012  2013  <20142015  2016  2017 
<== Date ==> <== Thread ==>

Subject: Build failed in Jenkins: epics-base-3.15-win32 #11
From: APS Jenkins <aps-jenkins@anl.gov>
To: core-talk@aps.anl.gov
Date: Tue, 1 Apr 2014 12:10:51 -0500 (CDT)
See <https://jenkins.aps.anl.gov/job/epics-base-3.15-win32/11/changes>

Changes:

[Andrew Johnson] libCom: Adjust the Posix epicsMutexOSD structure

Make pthread_mutex_t lock the first member of the
parent structure, so it's easy to convert between them.

------------------------------------------
[...truncated 147 lines...]
"Installing ../../../../templates/makeBaseApp/top/exampleApp/src/_APPNAME_Hello.dbd"
"Installing ../../../../templates/makeBaseApp/top/exampleApp/src/initTrace.c"
"Installing ../../../../templates/makeBaseApp/top/exampleApp/src/initTrace.dbd"
"Installing ../../../../templates/makeBaseApp/top/exampleBoot/Makefile"
mkdir ../../../../templates/makeBaseApp/top/exampleBoot
"Installing ../../../../templates/makeBaseApp/top/exampleBoot/nfsCommands@vxWorks"
"Installing ../../../../templates/makeBaseApp/top/exampleBoot/nfsCommands@RTEMS"
"Installing ../../../../templates/makeBaseApp/top/exampleBoot/ioc/Makefile@Common"
mkdir ../../../../templates/makeBaseApp/top/exampleBoot/ioc
"Installing ../../../../templates/makeBaseApp/top/exampleBoot/ioc/Makefile@vxWorks"
"Installing ../../../../templates/makeBaseApp/top/exampleBoot/ioc/Makefile@win32"
"Installing ../../../../templates/makeBaseApp/top/exampleBoot/ioc/st.cmd@Common"
"Installing ../../../../templates/makeBaseApp/top/exampleBoot/ioc/st.cmd@vxWorks"
"Installing ../../../../templates/makeBaseApp/top/exampleBoot/ioc/st.cmd@RTEMS"
"Installing ../../../../templates/makeBaseApp/top/exampleBoot/ioc/README@Common"
"Installing ../../../../templates/makeBaseApp/top/exampleBoot/ioc/README@vxWorks"
"Installing ../../../../templates/makeBaseApp/top/caClientApp/Makefile"
mkdir ../../../../templates/makeBaseApp/top/caClientApp
"Installing ../../../../templates/makeBaseApp/top/caClientApp/caExample.c"
"Installing ../../../../templates/makeBaseApp/top/caClientApp/caMonitor.c"
"Installing ../../../../templates/makeBaseApp/top/caServerApp/Makefile"
mkdir ../../../../templates/makeBaseApp/top/caServerApp
"Installing ../../../../templates/makeBaseApp/top/caServerApp/README"
"Installing ../../../../templates/makeBaseApp/top/caServerApp/exAsyncPV.cc"
"Installing ../../../../templates/makeBaseApp/top/caServerApp/exChannel.cc"
"Installing ../../../../templates/makeBaseApp/top/caServerApp/exPV.cc"
"Installing ../../../../templates/makeBaseApp/top/caServerApp/exScalarPV.cc"
"Installing ../../../../templates/makeBaseApp/top/caServerApp/exServer.cc"
"Installing ../../../../templates/makeBaseApp/top/caServerApp/exServer.h"
"Installing ../../../../templates/makeBaseApp/top/caServerApp/exVectorPV.cc"
"Installing ../../../../templates/makeBaseApp/top/caServerApp/main.cc"
"Installing ../../../../templates/makeBaseApp/top/caServerApp/test.adl"
"Installing ../../../../templates/makeBaseApp/top/caServerApp/vxEntry.cc"
"Installing ../../../../templates/makeBaseApp/top/iocBoot/Makefile"
mkdir ../../../../templates/makeBaseApp/top/iocBoot
"Installing ../../../../templates/makeBaseApp/top/iocBoot/nfsCommands@vxWorks"
"Installing ../../../../templates/makeBaseApp/top/iocBoot/nfsCommands@RTEMS"
"Installing ../../../../templates/makeBaseApp/top/iocBoot/ioc/Makefile@Common"
mkdir ../../../../templates/makeBaseApp/top/iocBoot/ioc
"Installing ../../../../templates/makeBaseApp/top/iocBoot/ioc/Makefile@vxWorks"
"Installing ../../../../templates/makeBaseApp/top/iocBoot/ioc/Makefile@win32"
"Installing ../../../../templates/makeBaseApp/top/iocBoot/ioc/st.cmd@Common"
"Installing ../../../../templates/makeBaseApp/top/iocBoot/ioc/st.cmd@Cross"
"Installing ../../../../templates/makeBaseApp/top/iocBoot/ioc/st.cmd@vxWorks"
"Installing ../../../../templates/makeBaseApp/top/iocBoot/ioc/st.cmd@RTEMS"
make[3]: Leaving directory `C:/jenkins/win32-1/workspace/epics-base-3.15-win32/src/template/base/O.win32-x86'
make[2]: Leaving directory `C:/jenkins/win32-1/workspace/epics-base-3.15-win32/src/template/base'
make -C template/ext install 
make[2]: Entering directory `C:/jenkins/win32-1/workspace/epics-base-3.15-win32/src/template/ext'
make -C O.win32-x86 -f ../Makefile TOP=../../../.. T_A=win32-x86 install
make[3]: Entering directory `C:/jenkins/win32-1/workspace/epics-base-3.15-win32/src/template/ext/O.win32-x86'
"Installing created executable ../../../../bin/win32-x86/makeBaseExt.pl"
"Installing ../../../../templates/makeBaseExt/top/Makefile"
mkdir ../../../../templates/makeBaseExt/top
"Installing ../../../../templates/makeBaseExt/top/README"
"Installing ../../../../templates/makeBaseExt/top/configure/CONFIG"
mkdir ../../../../templates/makeBaseExt/top/configure
"Installing ../../../../templates/makeBaseExt/top/configure/CONFIG_SITE"
"Installing ../../../../templates/makeBaseExt/top/configure/Makefile"
"Installing ../../../../templates/makeBaseExt/top/configure/RELEASE"
"Installing ../../../../templates/makeBaseExt/top/configure/RULES"
"Installing ../../../../templates/makeBaseExt/top/configure/RULES_DIRS"
"Installing ../../../../templates/makeBaseExt/top/configure/RULES_TOP"
"Installing ../../../../templates/makeBaseExt/top/configure/RULES_PYTHON"
"Installing ../../../../templates/makeBaseExt/top/configure/RULES_IDL"
"Installing ../../../../templates/makeBaseExt/top/configure/os/CONFIG.linux-x86.linux-386"
mkdir ../../../../templates/makeBaseExt/top/configure/os
"Installing ../../../../templates/makeBaseExt/top/configure/os/CONFIG_SITE.aix-ppc-gnu.aix-ppc-gnu"
"Installing ../../../../templates/makeBaseExt/top/configure/os/CONFIG_SITE.aix-ppc.aix-ppc"
"Installing ../../../../templates/makeBaseExt/top/configure/os/CONFIG_SITE.Common.Common"
"Installing ../../../../templates/makeBaseExt/top/configure/os/CONFIG_SITE.cygwin-x86.cygwin-x86"
"Installing ../../../../templates/makeBaseExt/top/configure/os/CONFIG_SITE.darwin-ppc.darwin-ppc"
"Installing ../../../../templates/makeBaseExt/top/configure/os/CONFIG_SITE.darwin-ppcx86.darwin-ppcx86"
"Installing ../../../../templates/makeBaseExt/top/configure/os/CONFIG_SITE.darwin-x86.darwin-x86"
"Installing ../../../../templates/makeBaseExt/top/configure/os/CONFIG_SITE.freebsd-x86_64.freebsd-x86_64"
"Installing ../../../../templates/makeBaseExt/top/configure/os/CONFIG_SITE.linux-ppc.linux-ppc"
"Installing ../../../../templates/makeBaseExt/top/configure/os/CONFIG_SITE.linux-x86-debug.linux-x86-debug"
"Installing ../../../../templates/makeBaseExt/top/configure/os/CONFIG_SITE.linux-x86.linux-athlon"
"Installing ../../../../templates/makeBaseExt/top/configure/os/CONFIG_SITE.linux-x86.linux-x86"
"Installing ../../../../templates/makeBaseExt/top/configure/os/CONFIG_SITE.linux-x86_64-debug.linux-x86_64-debug"
"Installing ../../../../templates/makeBaseExt/top/configure/os/CONFIG_SITE.linux-x86_64.linux-x86_64"
"Installing ../../../../templates/makeBaseExt/top/configure/os/CONFIG_SITE.solaris-sparc-debug.solaris-sparc-debug"
"Installing ../../../../templates/makeBaseExt/top/configure/os/CONFIG_SITE.solaris-sparc-gnu.solaris-sparc-gnu"
"Installing ../../../../templates/makeBaseExt/top/configure/os/CONFIG_SITE.solaris-sparc.solaris-sparc"
"Installing ../../../../templates/makeBaseExt/top/configure/os/CONFIG_SITE.solaris-sparc64-gnu.solaris-sparc64-gnu"
"Installing ../../../../templates/makeBaseExt/top/configure/os/CONFIG_SITE.solaris-sparc64.solaris-sparc64"
"Installing ../../../../templates/makeBaseExt/top/configure/os/CONFIG_SITE.solaris-x86-debug.solaris-x86-debug"
"Installing ../../../../templates/makeBaseExt/top/configure/os/CONFIG_SITE.solaris-x86-gnu.solaris-x86-gnu"
"Installing ../../../../templates/makeBaseExt/top/configure/os/CONFIG_SITE.solaris-x86.solaris-x86"
"Installing ../../../../templates/makeBaseExt/top/configure/os/CONFIG_SITE.solaris-x86_64.solaris-x86_64"
"Installing ../../../../templates/makeBaseExt/top/configure/os/CONFIG_SITE.win32-x86-cygwin.win32-x86-cygwin"
"Installing ../../../../templates/makeBaseExt/top/configure/os/CONFIG_SITE.win32-x86-debug.win32-x86-debug"
"Installing ../../../../templates/makeBaseExt/top/configure/os/CONFIG_SITE.win32-x86-mingw.win32-x86-mingw"
"Installing ../../../../templates/makeBaseExt/top/configure/os/CONFIG_SITE.win32-x86.win32-x86"
"Installing ../../../../templates/makeBaseExt/top/configure/os/CONFIG_SITE.windows-x64.windows-x64"
"Installing ../../../../templates/makeBaseExt/top/src/Makefile"
mkdir ../../../../templates/makeBaseExt/top/src
"Installing ../../../../templates/makeBaseExt/top/exampleExt/Makefile"
mkdir ../../../../templates/makeBaseExt/top/exampleExt
"Installing ../../../../templates/makeBaseExt/top/exampleExt/caExample.c"
"Installing ../../../../templates/makeBaseExt/top/exampleExt/RELEASE_NOTES.HTM"
"Installing ../../../../templates/makeBaseExt/top/simpleExt/Makefile"
mkdir ../../../../templates/makeBaseExt/top/simpleExt
make[3]: Leaving directory `C:/jenkins/win32-1/workspace/epics-base-3.15-win32/src/template/ext/O.win32-x86'
make[2]: Leaving directory `C:/jenkins/win32-1/workspace/epics-base-3.15-win32/src/template/ext'
make -C ./libCom install 
make[2]: Entering directory `C:/jenkins/win32-1/workspace/epics-base-3.15-win32/src/libCom'
make -C O.win32-x86 -f ../Makefile TOP=../../.. T_A=win32-x86 install
make[3]: Entering directory `C:/jenkins/win32-1/workspace/epics-base-3.15-win32/src/libCom/O.win32-x86'
perl -CSD ../../../bin/win32-x86/mkmf.pl  -m epicsGeneralTime.d . ../O.Common . ../../../src/libCom/osi/compiler/msvc ../../../src/libCom/osi/compiler/default . ../../../src/libCom/osi/os/WIN32 ../../../src/libCom/osi/os/default .. ../../../src/libCom/as ../../../src/libCom/bucketLib ../../../src/libCom/calc ../../../src/libCom/cvtFast ../../../src/libCom/cppStd ../../../src/libCom/cxxTemplates ../../../src/libCom/dbmf ../../../src/libCom/ellLib ../../../src/libCom/env ../../../src/libCom/error ../../../src/libCom/fdmgr ../../../src/libCom/flex ../../../src/libCom/freeList ../../../src/libCom/gpHash ../../../src/libCom/iocsh ../../../src/libCom/log ../../../src/libCom/macLib ../../../src/libCom/misc ../../../src/libCom/osi ../../../src/libCom/ring ../../../src/libCom/taskwd ../../../src/libCom/timer ../../../src/libCom/yacc ../../../src/libCom/yacc ../../../src/libCom/yajl ../../../include/compiler/msvc ../../../include/os/WIN32 ../../../include        epicsGeneralTime.d ../!
 ../../src/libCom/osi/epicsGeneralTime.c
ERROR opening file epicsGeneralTime.d for writing: Invalid argument
perl -CSD ../../../bin/win32-x86/mkmf.pl  -m epicsMath.d . ../O.Common . ../../../src/libCom/osi/compiler/msvc ../../../src/libCom/osi/compiler/default . ../../../src/libCom/osi/os/WIN32 ../../../src/libCom/osi/os/default .. ../../../src/libCom/as ../../../src/libCom/bucketLib ../../../src/libCom/calc ../../../src/libCom/cvtFast ../../../src/libCom/cppStd ../../../src/libCom/cxxTemplates ../../../src/libCom/dbmf ../../../src/libCom/ellLib ../../../src/libCom/env ../../../src/libCom/error ../../../src/libCom/fdmgr ../../../src/libCom/flex ../../../src/libCom/freeList ../../../src/libCom/gpHash ../../../src/libCom/iocsh ../../../src/libCom/log ../../../src/libCom/macLib ../../../src/libCom/misc ../../../src/libCom/osi ../../../src/libCom/ring ../../../src/libCom/taskwd ../../../src/libCom/timer ../../../src/libCom/yacc ../../../src/libCom/yacc ../../../src/libCom/yajl ../../../include/compiler/msvc ../../../include/os/WIN32 ../../../include        epicsMath.d ../../../src/libC!
 om/osi/epicsMath.cpp
ERROR opening file epicsMath.d for writing: Invalid argument
perl -CSD ../../../bin/win32-x86/mkmf.pl  -m epicsEvent.d . ../O.Common . ../../../src/libCom/osi/compiler/msvc ../../../src/libCom/osi/compiler/default . ../../../src/libCom/osi/os/WIN32 ../../../src/libCom/osi/os/default .. ../../../src/libCom/as ../../../src/libCom/bucketLib ../../../src/libCom/calc ../../../src/libCom/cvtFast ../../../src/libCom/cppStd ../../../src/libCom/cxxTemplates ../../../src/libCom/dbmf ../../../src/libCom/ellLib ../../../src/libCom/env ../../../src/libCom/error ../../../src/libCom/fdmgr ../../../src/libCom/flex ../../../src/libCom/freeList ../../../src/libCom/gpHash ../../../src/libCom/iocsh ../../../src/libCom/log ../../../src/libCom/macLib ../../../src/libCom/misc ../../../src/libCom/osi ../../../src/libCom/ring ../../../src/libCom/taskwd ../../../src/libCom/timer ../../../src/libCom/yacc ../../../src/libCom/yacc ../../../src/libCom/yajl ../../../include/compiler/msvc ../../../include/os/WIN32 ../../../include        epicsEvent.d ../../../src/li!
 bCom/osi/epicsEvent.cpp
ERROR opening file epicsEvent.d for writing: Invalid argument
perl -CSD ../../../bin/win32-x86/mkmf.pl  -m epicsExit.d . ../O.Common . ../../../src/libCom/osi/compiler/msvc ../../../src/libCom/osi/compiler/default . ../../../src/libCom/osi/os/WIN32 ../../../src/libCom/osi/os/default .. ../../../src/libCom/as ../../../src/libCom/bucketLib ../../../src/libCom/calc ../../../src/libCom/cvtFast ../../../src/libCom/cppStd ../../../src/libCom/cxxTemplates ../../../src/libCom/dbmf ../../../src/libCom/ellLib ../../../src/libCom/env ../../../src/libCom/error ../../../src/libCom/fdmgr ../../../src/libCom/flex ../../../src/libCom/freeList ../../../src/libCom/gpHash ../../../src/libCom/iocsh ../../../src/libCom/log ../../../src/libCom/macLib ../../../src/libCom/misc ../../../src/libCom/osi ../../../src/libCom/ring ../../../src/libCom/taskwd ../../../src/libCom/timer ../../../src/libCom/yacc ../../../src/libCom/yacc ../../../src/libCom/yajl ../../../include/compiler/msvc ../../../include/os/WIN32 ../../../include        epicsExit.d ../../../src/libC!
 om/misc/epicsExit.c
ERROR opening file epicsExit.d for writing: Invalid argument
perl -CSD ../../../bin/win32-x86/mkmf.pl  -m epicsConvert.d . ../O.Common . ../../../src/libCom/osi/compiler/msvc ../../../src/libCom/osi/compiler/default . ../../../src/libCom/osi/os/WIN32 ../../../src/libCom/osi/os/default .. ../../../src/libCom/as ../../../src/libCom/bucketLib ../../../src/libCom/calc ../../../src/libCom/cvtFast ../../../src/libCom/cppStd ../../../src/libCom/cxxTemplates ../../../src/libCom/dbmf ../../../src/libCom/ellLib ../../../src/libCom/env ../../../src/libCom/error ../../../src/libCom/fdmgr ../../../src/libCom/flex ../../../src/libCom/freeList ../../../src/libCom/gpHash ../../../src/libCom/iocsh ../../../src/libCom/log ../../../src/libCom/macLib ../../../src/libCom/misc ../../../src/libCom/osi ../../../src/libCom/ring ../../../src/libCom/taskwd ../../../src/libCom/timer ../../../src/libCom/yacc ../../../src/libCom/yacc ../../../src/libCom/yajl ../../../include/compiler/msvc ../../../include/os/WIN32 ../../../include        epicsConvert.d ../../../sr!
 c/libCom/misc/epicsConvert.c
ERROR opening file epicsConvert.d for writing: Invalid argument
"Installing created executable ../../../bin/win32-x86/antelope.exe"
"Installing created executable ../../../bin/win32-x86/e_flex.exe"
"Installing generic include file ../../../include/flex.skel.static"
mkdir ../../../include
"Installing generic include file ../../../include/asLib.h"
"Installing generic include file ../../../include/asTrapWrite.h"
"Installing generic include file ../../../include/bucketLib.h"
"Installing generic include file ../../../include/postfix.h"
"Installing generic include file ../../../include/cvtFast.h"
"Installing generic include file ../../../include/epicsAlgorithm.h"
"Installing generic include file ../../../include/epicsExcept.h"
"Installing generic include file ../../../include/epicsMemory.h"
"Installing generic include file ../../../include/resourceLib.h"
"Installing generic include file ../../../include/tsDLList.h"
"Installing generic include file ../../../include/tsSLList.h"
"Installing generic include file ../../../include/tsMinMax.h"
"Installing generic include file ../../../include/tsBTree.h"
"Installing generic include file ../../../include/tsFreeList.h"
"Installing generic include file ../../../include/epicsSingleton.h"
"Installing generic include file ../../../include/epicsGuard.h"
"Installing generic include file ../../../include/epicsOnce.h"
"Installing generic include file ../../../include/dbmf.h"
"Installing generic include file ../../../include/ellLib.h"
"Installing generic include file ../../../include/envDefs.h"
"Installing generic include file ../../../include/epicsPrint.h"
"Installing generic include file ../../../include/errMdef.h"
"Installing generic include file ../../../include/errSymTbl.h"
"Installing generic include file ../../../include/errlog.h"
"Installing generic include file ../../../include/error.h"
"Installing generic include file ../../../include/fdManager.h"
"Installing generic include file ../../../include/fdmgr.h"
"Installing generic include file ../../../include/freeList.h"
"Installing generic include file ../../../include/gpHash.h"
"Installing generic include file ../../../include/iocsh.h"
"Installing generic include file ../../../include/registry.h"
"Installing generic include file ../../../include/libComRegister.h"
"Installing generic include file ../../../include/iocLog.h"
"Installing generic include file ../../../include/logClient.h"
"Installing generic include file ../../../include/macLib.h"
"Installing generic include file ../../../include/alarm.h"
"Installing generic include file ../../../include/alarmString.h"
"Installing generic include file ../../../include/adjustment.h"
"Installing generic include file ../../../include/cantProceed.h"
"Installing generic include file ../../../include/dbDefs.h"
"Installing generic include file ../../../include/epicsConvert.h"
"Installing generic include file ../../../include/epicsExit.h"
"Installing generic include file ../../../include/epicsStdlib.h"
"Installing generic include file ../../../include/epicsString.h"
"Installing generic include file ../../../include/epicsTypes.h"
"Installing generic include file ../../../include/shareLib.h"
"Installing generic include file ../../../include/epicsExport.h"
"Installing generic include file ../../../include/unixFileName.h"
"Installing generic include file ../../../include/locationException.h"
"Installing generic include file ../../../include/ipAddrToAsciiAsynchronous.h"
"Installing generic include file ../../../include/compilerDependencies.h"
"Installing generic include file ../../../include/epicsUnitTest.h"
"Installing generic include file ../../../include/testMain.h"
"Installing generated generic include file ../../../include/epicsVersion.h"
"Installing generic include file ../../../include/compiler/msvc/compilerSpecific.h"
mkdir ../../../include/compiler
mkdir ../../../include/compiler/msvc
"Installing generic include file ../../../include/os/WIN32/osiFileName.h"
mkdir ../../../include/os
mkdir ../../../include/os/WIN32
"Installing generic include file ../../../include/osiSock.h"
"Installing generic include file ../../../include/os/WIN32/osdSock.h"
"Installing generic include file ../../../include/epicsInterrupt.h"
"Installing OS dependent include file ../../../include/os/WIN32/osdInterrupt.h"
"Installing generic include file ../../../include/epicsMutex.h"
"Installing generic include file ../../../include/os/WIN32/osdMutex.h"
"Installing generic include file ../../../include/epicsSpin.h"
"Installing generic include file ../../../include/epicsEvent.h"
"Installing generic include file ../../../include/os/WIN32/osdEvent.h"
"Installing generic include file ../../../include/os/WIN32/epicsMath.h"
"Installing OS dependent include file ../../../include/os/WIN32/osdMessageQueue.h"
"Installing generic include file ../../../include/os/WIN32/osdStrtod.h"
"Installing generic include file ../../../include/epicsAssert.h"
"Installing generic include file ../../../include/epicsFindSymbol.h"
"Installing generic include file ../../../include/osiPoolStatus.h"
"Installing generic include file ../../../include/os/WIN32/osdPoolStatus.h"
"Installing generic include file ../../../include/os/WIN32/osdThread.h"
"Installing generic include file ../../../include/epicsThread.h"
"Installing generic include file ../../../include/epicsTime.h"
"Installing generic include file ../../../include/epicsGeneralTime.h"
"Installing generic include file ../../../include/os/WIN32/osdTime.h"
"Installing generic include file ../../../include/generalTimeSup.h"
"Installing generic include file ../../../include/osiClockTime.h"
"Installing generic include file ../../../include/epicsSignal.h"
"Installing generic include file ../../../include/osiProcess.h"
"Installing generic include file ../../../include/os/WIN32/osiUnistd.h"
"Installing generic include file ../../../include/osiWireFormat.h"
"Installing OS dependent include file ../../../include/os/WIN32/osdWireFormat.h"
"Installing generic include file ../../../include/os/WIN32/osdWireConfig.h"
"Installing generic include file ../../../include/epicsAtomic.h"
"Installing generic include file ../../../include/epicsAtomicDefault.h"
"Installing generic include file ../../../include/os/WIN32/epicsAtomicOSD.h"
"Installing generic include file ../../../include/compiler/msvc/epicsAtomicCD.h"
"Installing generic include file ../../../include/epicsEndian.h"
"Installing OS dependent include file ../../../include/os/WIN32/epicsReadline.h"
"Installing generic include file ../../../include/epicsMessageQueue.h"
"Installing generic include file ../../../include/epicsStdio.h"
"Installing generic include file ../../../include/epicsStdioRedirect.h"
"Installing generic include file ../../../include/epicsTempFile.h"
"Installing generic include file ../../../include/os/WIN32/epicsGetopt.h"
"Installing generic include file ../../../include/devLib.h"
"Installing generic include file ../../../include/devLibVME.h"
"Installing generic include file ../../../include/devLibVMEImpl.h"
"Installing OS dependent include file ../../../include/os/WIN32/osdVME.h"
"Installing generic include file ../../../include/epicsRingPointer.h"
"Installing generic include file ../../../include/epicsRingBytes.h"
"Installing generic include file ../../../include/taskwd.h"
"Installing generic include file ../../../include/epicsTimer.h"
"Installing generic include file ../../../include/yajl_common.h"
"Installing generic include file ../../../include/yajl_gen.h"
"Installing generic include file ../../../include/yajl_parse.h"
"Installing generic include file ../../../include/os/WIN32/epicsAtomicMS.h"
cl               -nologo -D__STDC__=0 -D_CRT_SECURE_NO_DEPRECATE -D_CRT_NONSTDC_NO_DEPRECATE   -Ox -GL   -W3 -w44355       -MD -DEPICS_BUILD_DLL -DEPICS_CALL_DLL   -I. -I../O.Common -I. -I../../../src/libCom/osi/compiler/msvc -I../../../src/libCom/osi/compiler/default -I. -I../../../src/libCom/osi/os/WIN32 -I../../../src/libCom/osi/os/default -I.. -I../../../src/libCom/as -I../../../src/libCom/bucketLib -I../../../src/libCom/calc -I../../../src/libCom/cvtFast -I../../../src/libCom/cppStd -I../../../src/libCom/cxxTemplates -I../../../src/libCom/dbmf -I../../../src/libCom/ellLib -I../../../src/libCom/env -I../../../src/libCom/error -I../../../src/libCom/fdmgr -I../../../src/libCom/flex -I../../../src/libCom/freeList -I../../../src/libCom/gpHash -I../../../src/libCom/iocsh -I../../../src/libCom/log -I../../../src/libCom/macLib -I../../../src/libCom/misc -I../../../src/libCom/osi -I../../../src/libCom/ring -I../../../src/libCom/taskwd -I../../../src/libCom/timer -I../../../src/l!
 ibCom/yacc -I../../../src/libCom/yacc -I../../../src/libCom/yajl -I../../../include/compiler/msvc -I../../../include/os/WIN32 -I../../../include        -c ../../../src/libCom/misc/epicsConvert.c
epicsConvert.c
<https://jenkins.aps.anl.gov/job/epics-base-3.15-win32/ws/src\libCom\misc\epicsConvert.c> : fatal error C1083: Cannot open compiler generated file: 'epicsConvert.obj': Invalid argument
make[3]: *** [epicsConvert.obj] Error 1
make[3]: Leaving directory `C:/jenkins/win32-1/workspace/epics-base-3.15-win32/src/libCom/O.win32-x86'
make[2]: *** [install.win32-x86] Error 2
make[2]: Leaving directory `C:/jenkins/win32-1/workspace/epics-base-3.15-win32/src/libCom'
make[1]: *** [libCom.install] Error 2
make[1]: Leaving directory `C:/jenkins/win32-1/workspace/epics-base-3.15-win32/src'
make: *** [src.install] Error 2

<https://jenkins.aps.anl.gov/job/epics-base-3.15-win32/ws/>exit> 2 
Build step 'Execute Windows batch command' marked build as failure
[WARNINGS] Skipping publisher since build result is FAILURE


Replies:
Jenkins build is back to normal : epics-base-3.15-win32 #12 APS Jenkins

Navigate by Date:
Prev: Re: caPutLog support for gateway Konrad, Martin
Next: Build failed in Jenkins: epics-base-3.15-win32s #3 APS Jenkins
Index: 2002  2003  2004  2005  2006  2007  2008  2009  2010  2011  2012  2013  <20142015  2016  2017 
Navigate by Thread:
Prev: Re: caPutLog support for gateway Andrew Johnson
Next: Jenkins build is back to normal : epics-base-3.15-win32 #12 APS Jenkins
Index: 2002  2003  2004  2005  2006  2007  2008  2009  2010  2011  2012  2013  <20142015  2016  2017 
ANJ, 16 May 2014 Valid HTML 4.01! · Home · News · About · Base · Modules · Extensions · Distributions · Download ·
· EPICS V4 · IRMIS · Talk · Bugs · Documents · Links · Licensing ·