Argonne National Laboratory

Experimental Physics and
Industrial Control System

2002  2003  2004  2005  2006  2007  2008  2009  2010  2011  2012  2013  <20142015  2016  2017  Index 2002  2003  2004  2005  2006  2007  2008  2009  2010  2011  2012  2013  <20142015  2016  2017 
<== Date ==> <== Thread ==>

Subject: Build failed in Jenkins: epics-base-3.15-win64s #1
From: APS Jenkins <aps-jenkins@anl.gov>
To: core-talk@aps.anl.gov
Date: Thu, 13 Mar 2014 16:28:23 -0500 (CDT)
See <https://jenkins.aps.anl.gov/job/epics-base-3.15-win64s/1/>

------------------------------------------
[...truncated 2241 lines...]
registryCommon.c
cl             /favor:blend   -nologo -D__STDC__=0 -D_CRT_SECURE_NO_DEPRECATE -D_CRT_NONSTDC_NO_DEPRECATE   -Ox -GL   -W3 -w44355        -MT    -I. -I../O.Common -I. -I. -I.. -I../../../src/ioc/as -I../../../src/ioc/bpt -I../../../src/ioc/db -I../../../src/ioc/dbStatic -I../../../src/ioc/dbtemplate -I../../../src/ioc/misc -I../../../src/ioc/registry -I../../../src/ioc/rsrv -I../../../include/compiler/msvc -I../../../include/os/WIN32 -I../../../include        -c ../../../src/ioc/registry/registryIocRegister.c
registryIocRegister.c
cl             /favor:blend   -nologo -D__STDC__=0 -D_CRT_SECURE_NO_DEPRECATE -D_CRT_NONSTDC_NO_DEPRECATE   -Ox -GL   -W3 -w44355        -MT    -I. -I../O.Common -I. -I. -I.. -I../../../src/ioc/as -I../../../src/ioc/bpt -I../../../src/ioc/db -I../../../src/ioc/dbStatic -I../../../src/ioc/dbtemplate -I../../../src/ioc/misc -I../../../src/ioc/registry -I../../../src/ioc/rsrv -I../../../include/compiler/msvc -I../../../include/os/WIN32 -I../../../include    -I../../../src/ca/client    -c ../../../src/ioc/rsrv/caserverio.c
caserverio.c
cl             /favor:blend   -nologo -D__STDC__=0 -D_CRT_SECURE_NO_DEPRECATE -D_CRT_NONSTDC_NO_DEPRECATE   -Ox -GL   -W3 -w44355        -MT    -I. -I../O.Common -I. -I. -I.. -I../../../src/ioc/as -I../../../src/ioc/bpt -I../../../src/ioc/db -I../../../src/ioc/dbStatic -I../../../src/ioc/dbtemplate -I../../../src/ioc/misc -I../../../src/ioc/registry -I../../../src/ioc/rsrv -I../../../include/compiler/msvc -I../../../include/os/WIN32 -I../../../include        -c ../../../src/ioc/rsrv/caservertask.c
caservertask.c
../../../src/ioc/rsrv/caservertask.c(192) : warning C4244: 'function' : conversion from 'SOCKET' to 'int', possible loss of data
cl             /favor:blend   -nologo -D__STDC__=0 -D_CRT_SECURE_NO_DEPRECATE -D_CRT_NONSTDC_NO_DEPRECATE   -Ox -GL   -W3 -w44355        -MT    -I. -I../O.Common -I. -I. -I.. -I../../../src/ioc/as -I../../../src/ioc/bpt -I../../../src/ioc/db -I../../../src/ioc/dbStatic -I../../../src/ioc/dbtemplate -I../../../src/ioc/misc -I../../../src/ioc/registry -I../../../src/ioc/rsrv -I../../../include/compiler/msvc -I../../../include/os/WIN32 -I../../../include        -c ../../../src/ioc/rsrv/camsgtask.c
camsgtask.c
cl             /favor:blend   -nologo -D__STDC__=0 -D_CRT_SECURE_NO_DEPRECATE -D_CRT_NONSTDC_NO_DEPRECATE   -Ox -GL   -W3 -w44355        -MT    -I. -I../O.Common -I. -I. -I.. -I../../../src/ioc/as -I../../../src/ioc/bpt -I../../../src/ioc/db -I../../../src/ioc/dbStatic -I../../../src/ioc/dbtemplate -I../../../src/ioc/misc -I../../../src/ioc/registry -I../../../src/ioc/rsrv -I../../../include/compiler/msvc -I../../../include/os/WIN32 -I../../../include    -I../../../src/ca/client    -c ../../../src/ioc/rsrv/camessage.c
camessage.c
../../../src/ioc/rsrv/camessage.c(913) : warning C4267: '=' : conversion from 'size_t' to 'unsigned int', possible loss of data
../../../src/ioc/rsrv/camessage.c(992) : warning C4267: '=' : conversion from 'size_t' to 'unsigned int', possible loss of data
cl             /favor:blend   -nologo -D__STDC__=0 -D_CRT_SECURE_NO_DEPRECATE -D_CRT_NONSTDC_NO_DEPRECATE   -Ox -GL   -W3 -w44355        -MT    -I. -I../O.Common -I. -I. -I.. -I../../../src/ioc/as -I../../../src/ioc/bpt -I../../../src/ioc/db -I../../../src/ioc/dbStatic -I../../../src/ioc/dbtemplate -I../../../src/ioc/misc -I../../../src/ioc/registry -I../../../src/ioc/rsrv -I../../../include/compiler/msvc -I../../../include/os/WIN32 -I../../../include        -c ../../../src/ioc/rsrv/cast_server.c
cast_server.c
cl             /favor:blend   -nologo -D__STDC__=0 -D_CRT_SECURE_NO_DEPRECATE -D_CRT_NONSTDC_NO_DEPRECATE   -Ox -GL   -W3 -w44355        -MT    -I. -I../O.Common -I. -I. -I.. -I../../../src/ioc/as -I../../../src/ioc/bpt -I../../../src/ioc/db -I../../../src/ioc/dbStatic -I../../../src/ioc/dbtemplate -I../../../src/ioc/misc -I../../../src/ioc/registry -I../../../src/ioc/rsrv -I../../../include/compiler/msvc -I../../../include/os/WIN32 -I../../../include        -c ../../../src/ioc/rsrv/online_notify.c
online_notify.c
cl             /favor:blend   -nologo -D__STDC__=0 -D_CRT_SECURE_NO_DEPRECATE -D_CRT_NONSTDC_NO_DEPRECATE   -Ox -GL   -W3 -w44355        -MT    -I. -I../O.Common -I. -I. -I.. -I../../../src/ioc/as -I../../../src/ioc/bpt -I../../../src/ioc/db -I../../../src/ioc/dbStatic -I../../../src/ioc/dbtemplate -I../../../src/ioc/misc -I../../../src/ioc/registry -I../../../src/ioc/rsrv -I../../../include/compiler/msvc -I../../../include/os/WIN32 -I../../../include        -c ../../../src/ioc/rsrv/rsrvIocRegister.c
rsrvIocRegister.c
rc -l 0x409 -I. -I../O.Common -I. -I. -I.. -I../../../src/ioc/as -I../../../src/ioc/bpt -I../../../src/ioc/db -I../../../src/ioc/dbStatic -I../../../src/ioc/dbtemplate -I../../../src/ioc/misc -I../../../src/ioc/registry -I../../../src/ioc/rsrv -I../../../include/compiler/msvc -I../../../include/os/WIN32 -I../../../include        -fo dbCore.res ../dbCore.rc
Microsoft (R) Windows (R) Resource Compiler Version 6.1.7600.16385

Copyright (C) Microsoft Corporation.  All rights reserved.


lib -nologo -verbose -out:dbCore.lib -LTCG       asDbLib.obj asCa.obj asIocRegister.obj dbLock.obj dbAccess.obj dbBkpt.obj dbChannel.obj dbConvert.obj dbFastLinkConv.obj dbExtractArray.obj dbLink.obj dbNotify.obj dbScan.obj dbEvent.obj dbTest.obj db_access.obj db_test.obj recGbl.obj callback.obj dbCa.obj dbCaTest.obj initHooks.obj cvtBpt.obj dbContext.obj dbChannelIO.obj dbSubscriptionIO.obj dbPutNotifyBlocker.obj dbContextReadNotifyCache.obj templateInstances.obj dbIocRegister.obj chfPlugin.obj dbState.obj dbStaticLib.obj dbYacc.obj dbPvdLib.obj dbStaticRun.obj dbStaticIocRegister.obj dbLoadTemplate.obj dbtoolsIocRegister.obj epicsRelease.obj iocInit.obj miscIocRegister.obj dlload.obj iocshRegisterCommon.obj registryRecordType.obj registryDeviceSupport.obj registryDriverSupport.obj registryFunction.obj registryCommon.obj registryIocRegister.obj caserverio.obj caservertask.obj camsgtask.obj camessage.obj cast_server.obj online_notify.obj rsrvIocRegister.obj 
Appending rsrvIocRegister.obj
Appending online_notify.obj
Appending cast_server.obj
Appending camessage.obj
Appending camsgtask.obj
Appending caservertask.obj
Appending caserverio.obj
Appending registryIocRegister.obj
Appending registryCommon.obj
Appending registryFunction.obj
Appending registryDriverSupport.obj
Appending registryDeviceSupport.obj
Appending registryRecordType.obj
Appending iocshRegisterCommon.obj
Appending dlload.obj
Appending miscIocRegister.obj
Appending iocInit.obj
Appending epicsRelease.obj
Appending dbtoolsIocRegister.obj
Appending dbLoadTemplate.obj
Appending dbStaticIocRegister.obj
Appending dbStaticRun.obj
Appending dbPvdLib.obj
Appending dbYacc.obj
Appending dbStaticLib.obj
Appending dbState.obj
Appending chfPlugin.obj
Appending dbIocRegister.obj
Appending templateInstances.obj
Appending dbContextReadNotifyCache.obj
Appending dbPutNotifyBlocker.obj
Appending dbSubscriptionIO.obj
Appending dbChannelIO.obj
Appending dbContext.obj
Appending cvtBpt.obj
Appending initHooks.obj
Appending dbCaTest.obj
Appending dbCa.obj
Appending callback.obj
Appending recGbl.obj
Appending db_test.obj
Appending db_access.obj
Appending dbTest.obj
Appending dbEvent.obj
Appending dbScan.obj
Appending dbNotify.obj
Appending dbLink.obj
Appending dbExtractArray.obj
Appending dbFastLinkConv.obj
Appending dbConvert.obj
Appending dbChannel.obj
Appending dbBkpt.obj
Appending dbAccess.obj
Appending dbLock.obj
Appending asIocRegister.obj
Appending asCa.obj
Appending asDbLib.obj
cl             /favor:blend   -nologo -D__STDC__=0 -D_CRT_SECURE_NO_DEPRECATE -D_CRT_NONSTDC_NO_DEPRECATE   -Ox -GL   -W3 -w44355        -MT    -I. -I../O.Common -I. -I. -I.. -I../../../src/ioc/as -I../../../src/ioc/bpt -I../../../src/ioc/db -I../../../src/ioc/dbStatic -I../../../src/ioc/dbtemplate -I../../../src/ioc/misc -I../../../src/ioc/registry -I../../../src/ioc/rsrv -I../../../include/compiler/msvc -I../../../include/os/WIN32 -I../../../include        -c ../../../src/ioc/as/ascheck.c
ascheck.c
link -nologo  -LTCG -incremental:no -opt:ref -release -version:3.15 /MACHINE:X64              -out:ascheck.exe       ascheck.obj     ../../../lib/windows-x64-static/dbCore.lib  ../../../lib/windows-x64-static/Com.lib  ws2_32.lib advapi32.lib user32.lib kernel32.lib winmm.lib     
Generating code
Finished generating code
cl             /favor:blend   -nologo -D__STDC__=0 -D_CRT_SECURE_NO_DEPRECATE -D_CRT_NONSTDC_NO_DEPRECATE   -Ox -GL   -W3 -w44355        -MT    -I. -I../O.Common -I. -I. -I.. -I../../../src/ioc/as -I../../../src/ioc/bpt -I../../../src/ioc/db -I../../../src/ioc/dbStatic -I../../../src/ioc/dbtemplate -I../../../src/ioc/misc -I../../../src/ioc/registry -I../../../src/ioc/rsrv -I../../../include/compiler/msvc -I../../../include/os/WIN32 -I../../../include        -c ../../../src/ioc/bpt/makeBpt.c
makeBpt.c
../../../src/ioc/bpt/makeBpt.c(145) : warning C4244: '=' : conversion from '__int64' to 'int', possible loss of data
link -nologo  -LTCG -incremental:no -opt:ref -release -version:3.15 /MACHINE:X64              -out:makeBpt.exe       makeBpt.obj      ../../../lib/windows-x64-static/Com.lib  ws2_32.lib advapi32.lib user32.lib kernel32.lib winmm.lib     
Generating code
Finished generating code
cl             /favor:blend   -nologo -D__STDC__=0 -D_CRT_SECURE_NO_DEPRECATE -D_CRT_NONSTDC_NO_DEPRECATE   -Ox -GL   -W3 -w44355        -MT    -I. -I../O.Common -I. -I. -I.. -I../../../src/ioc/as -I../../../src/ioc/bpt -I../../../src/ioc/db -I../../../src/ioc/dbStatic -I../../../src/ioc/dbtemplate -I../../../src/ioc/misc -I../../../src/ioc/registry -I../../../src/ioc/rsrv -I../../../include/compiler/msvc -I../../../include/os/WIN32 -I../../../include        -c ../../../src/ioc/dbtemplate/msi.c
msi.c
../../../src/ioc/dbtemplate/msi.c(327) : warning C4267: '=' : conversion from 'size_t' to 'int', possible loss of data
link -nologo  -LTCG -incremental:no -opt:ref -release -version:3.15 /MACHINE:X64              -out:msi.exe       msi.obj     ../../../lib/windows-x64-static/Com.lib  ../../../lib/windows-x64-static/Com.lib  ws2_32.lib advapi32.lib user32.lib kernel32.lib winmm.lib     
Generating code
Finished generating code
make[3]: Leaving directory `C:/jenkins64-1/workspace/epics-base-3.15-win64/src/ioc/O.windows-x64-static'
make[2]: Leaving directory `C:/jenkins64-1/workspace/epics-base-3.15-win64/src/ioc'
make -C ca/legacy/pcas/ex windows-x64-static 
make[2]: Entering directory `C:/jenkins64-1/workspace/epics-base-3.15-win64/src/ca/legacy/pcas/ex'
perl -CSD ../../../../../bin/windows-x64/makeMakefile.pl O.windows-x64-static ../../../../../..
make -C O.windows-x64 -f ../Makefile TOP=../../../../../.. T_A=windows-x64
make[3]: Entering directory `C:/jenkins64-1/workspace/epics-base-3.15-win64/src/ca/legacy/pcas/ex/O.windows-x64'
make[3]: Nothing to be done for `all'.
make[3]: Leaving directory `C:/jenkins64-1/workspace/epics-base-3.15-win64/src/ca/legacy/pcas/ex/O.windows-x64'
make -C O.windows-x64-static -f ../Makefile TOP=../../../../../.. T_A=windows-x64-static
make[3]: Entering directory `C:/jenkins64-1/workspace/epics-base-3.15-win64/src/ca/legacy/pcas/ex/O.windows-x64-static'
perl -CSD ../../../../../../bin/windows-x64/mkmf.pl  -m exChannel.d . ../O.Common . . .. ../../../../../../src/template/base/top/caServerApp ../../../../../../include/compiler/msvc ../../../../../../include/os/WIN32 ../../../../../../include        exChannel.d ../../../../../../src/template/base/top/caServerApp/exChannel.cc
perl -CSD ../../../../../../bin/windows-x64/mkmf.pl  -m exAsyncPV.d . ../O.Common . . .. ../../../../../../src/template/base/top/caServerApp ../../../../../../include/compiler/msvc ../../../../../../include/os/WIN32 ../../../../../../include        exAsyncPV.d ../../../../../../src/template/base/top/caServerApp/exAsyncPV.cc
perl -CSD ../../../../../../bin/windows-x64/mkmf.pl  -m exScalarPV.d . ../O.Common . . .. ../../../../../../src/template/base/top/caServerApp ../../../../../../include/compiler/msvc ../../../../../../include/os/WIN32 ../../../../../../include        exScalarPV.d ../../../../../../src/template/base/top/caServerApp/exScalarPV.cc
perl -CSD ../../../../../../bin/windows-x64/mkmf.pl  -m exVectorPV.d . ../O.Common . . .. ../../../../../../src/template/base/top/caServerApp ../../../../../../include/compiler/msvc ../../../../../../include/os/WIN32 ../../../../../../include        exVectorPV.d ../../../../../../src/template/base/top/caServerApp/exVectorPV.cc
perl -CSD ../../../../../../bin/windows-x64/mkmf.pl  -m exPV.d . ../O.Common . . .. ../../../../../../src/template/base/top/caServerApp ../../../../../../include/compiler/msvc ../../../../../../include/os/WIN32 ../../../../../../include        exPV.d ../../../../../../src/template/base/top/caServerApp/exPV.cc
perl -CSD ../../../../../../bin/windows-x64/mkmf.pl  -m exServer.d . ../O.Common . . .. ../../../../../../src/template/base/top/caServerApp ../../../../../../include/compiler/msvc ../../../../../../include/os/WIN32 ../../../../../../include        exServer.d ../../../../../../src/template/base/top/caServerApp/exServer.cc
perl -CSD ../../../../../../bin/windows-x64/mkmf.pl  -m main.d . ../O.Common . . .. ../../../../../../src/template/base/top/caServerApp ../../../../../../include/compiler/msvc ../../../../../../include/os/WIN32 ../../../../../../include        main.d ../../../../../../src/template/base/top/caServerApp/main.cc
make[3]: Leaving directory `C:/jenkins64-1/workspace/epics-base-3.15-win64/src/ca/legacy/pcas/ex/O.windows-x64-static'
make[3]: Entering directory `C:/jenkins64-1/workspace/epics-base-3.15-win64/src/ca/legacy/pcas/ex/O.windows-x64-static'
cl -EHsc -GR             /favor:blend   -nologo -D__STDC__=0 -D_CRT_SECURE_NO_DEPRECATE -D_CRT_NONSTDC_NO_DEPRECATE   -Ox -GL   -W3 -w44355        -MT  -TP  -I. -I../O.Common -I. -I. -I.. -I../../../../../../src/template/base/top/caServerApp -I../../../../../../include/compiler/msvc -I../../../../../../include/os/WIN32 -I../../../../../../include        -c ../../../../../../src/template/base/top/caServerApp/main.cc
main.cc
c:\jenkins64-1\workspace\epics-base-3.15-win64\include\aitHelpers.h(326) : warning C4267: 'initializing' : conversion from 'size_t' to 'unsigned int', possible loss of data
c:\jenkins64-1\workspace\epics-base-3.15-win64\include\aitHelpers.h(353) : warning C4267: 'initializing' : conversion from 'size_t' to 'unsigned int', possible loss of data
c:\jenkins64-1\workspace\epics-base-3.15-win64\include\aitHelpers.h(381) : warning C4267: 'initializing' : conversion from 'size_t' to 'unsigned int', possible loss of data
c:\jenkins64-1\workspace\epics-base-3.15-win64\include\aitHelpers.h(399) : warning C4267: 'argument' : conversion from 'size_t' to 'unsigned int', possible loss of data
c:\jenkins64-1\workspace\epics-base-3.15-win64\include\aitHelpers.h(439) : warning C4267: 'initializing' : conversion from 'size_t' to 'unsigned int', possible loss of data
cl -EHsc -GR             /favor:blend   -nologo -D__STDC__=0 -D_CRT_SECURE_NO_DEPRECATE -D_CRT_NONSTDC_NO_DEPRECATE   -Ox -GL   -W3 -w44355        -MT  -TP  -I. -I../O.Common -I. -I. -I.. -I../../../../../../src/template/base/top/caServerApp -I../../../../../../include/compiler/msvc -I../../../../../../include/os/WIN32 -I../../../../../../include        -c ../../../../../../src/template/base/top/caServerApp/exServer.cc
exServer.cc
c:\jenkins64-1\workspace\epics-base-3.15-win64\include\aitHelpers.h(326) : warning C4267: 'initializing' : conversion from 'size_t' to 'unsigned int', possible loss of data
c:\jenkins64-1\workspace\epics-base-3.15-win64\include\aitHelpers.h(353) : warning C4267: 'initializing' : conversion from 'size_t' to 'unsigned int', possible loss of data
c:\jenkins64-1\workspace\epics-base-3.15-win64\include\aitHelpers.h(381) : warning C4267: 'initializing' : conversion from 'size_t' to 'unsigned int', possible loss of data
c:\jenkins64-1\workspace\epics-base-3.15-win64\include\aitHelpers.h(399) : warning C4267: 'argument' : conversion from 'size_t' to 'unsigned int', possible loss of data
c:\jenkins64-1\workspace\epics-base-3.15-win64\include\aitHelpers.h(439) : warning C4267: 'initializing' : conversion from 'size_t' to 'unsigned int', possible loss of data
cl -EHsc -GR             /favor:blend   -nologo -D__STDC__=0 -D_CRT_SECURE_NO_DEPRECATE -D_CRT_NONSTDC_NO_DEPRECATE   -Ox -GL   -W3 -w44355        -MT  -TP  -I. -I../O.Common -I. -I. -I.. -I../../../../../../src/template/base/top/caServerApp -I../../../../../../include/compiler/msvc -I../../../../../../include/os/WIN32 -I../../../../../../include        -c ../../../../../../src/template/base/top/caServerApp/exPV.cc
exPV.cc
c:\jenkins64-1\workspace\epics-base-3.15-win64\include\aitHelpers.h(326) : warning C4267: 'initializing' : conversion from 'size_t' to 'unsigned int', possible loss of data
c:\jenkins64-1\workspace\epics-base-3.15-win64\include\aitHelpers.h(353) : warning C4267: 'initializing' : conversion from 'size_t' to 'unsigned int', possible loss of data
c:\jenkins64-1\workspace\epics-base-3.15-win64\include\aitHelpers.h(381) : warning C4267: 'initializing' : conversion from 'size_t' to 'unsigned int', possible loss of data
c:\jenkins64-1\workspace\epics-base-3.15-win64\include\aitHelpers.h(399) : warning C4267: 'argument' : conversion from 'size_t' to 'unsigned int', possible loss of data
c:\jenkins64-1\workspace\epics-base-3.15-win64\include\aitHelpers.h(439) : warning C4267: 'initializing' : conversion from 'size_t' to 'unsigned int', possible loss of data
cl -EHsc -GR             /favor:blend   -nologo -D__STDC__=0 -D_CRT_SECURE_NO_DEPRECATE -D_CRT_NONSTDC_NO_DEPRECATE   -Ox -GL   -W3 -w44355        -MT  -TP  -I. -I../O.Common -I. -I. -I.. -I../../../../../../src/template/base/top/caServerApp -I../../../../../../include/compiler/msvc -I../../../../../../include/os/WIN32 -I../../../../../../include        -c ../../../../../../src/template/base/top/caServerApp/exVectorPV.cc
exVectorPV.cc
c:\jenkins64-1\workspace\epics-base-3.15-win64\include\aitHelpers.h(326) : warning C4267: 'initializing' : conversion from 'size_t' to 'unsigned int', possible loss of data
c:\jenkins64-1\workspace\epics-base-3.15-win64\include\aitHelpers.h(353) : warning C4267: 'initializing' : conversion from 'size_t' to 'unsigned int', possible loss of data
c:\jenkins64-1\workspace\epics-base-3.15-win64\include\aitHelpers.h(381) : warning C4267: 'initializing' : conversion from 'size_t' to 'unsigned int', possible loss of data
c:\jenkins64-1\workspace\epics-base-3.15-win64\include\aitHelpers.h(399) : warning C4267: 'argument' : conversion from 'size_t' to 'unsigned int', possible loss of data
c:\jenkins64-1\workspace\epics-base-3.15-win64\include\aitHelpers.h(439) : warning C4267: 'initializing' : conversion from 'size_t' to 'unsigned int', possible loss of data
cl -EHsc -GR             /favor:blend   -nologo -D__STDC__=0 -D_CRT_SECURE_NO_DEPRECATE -D_CRT_NONSTDC_NO_DEPRECATE   -Ox -GL   -W3 -w44355        -MT  -TP  -I. -I../O.Common -I. -I. -I.. -I../../../../../../src/template/base/top/caServerApp -I../../../../../../include/compiler/msvc -I../../../../../../include/os/WIN32 -I../../../../../../include        -c ../../../../../../src/template/base/top/caServerApp/exScalarPV.cc
exScalarPV.cc
c:\jenkins64-1\workspace\epics-base-3.15-win64\include\aitHelpers.h(326) : warning C4267: 'initializing' : conversion from 'size_t' to 'unsigned int', possible loss of data
c:\jenkins64-1\workspace\epics-base-3.15-win64\include\aitHelpers.h(353) : warning C4267: 'initializing' : conversion from 'size_t' to 'unsigned int', possible loss of data
c:\jenkins64-1\workspace\epics-base-3.15-win64\include\aitHelpers.h(381) : warning C4267: 'initializing' : conversion from 'size_t' to 'unsigned int', possible loss of data
c:\jenkins64-1\workspace\epics-base-3.15-win64\include\aitHelpers.h(399) : warning C4267: 'argument' : conversion from 'size_t' to 'unsigned int', possible loss of data
c:\jenkins64-1\workspace\epics-base-3.15-win64\include\aitHelpers.h(439) : warning C4267: 'initializing' : conversion from 'size_t' to 'unsigned int', possible loss of data
cl -EHsc -GR             /favor:blend   -nologo -D__STDC__=0 -D_CRT_SECURE_NO_DEPRECATE -D_CRT_NONSTDC_NO_DEPRECATE   -Ox -GL   -W3 -w44355        -MT  -TP  -I. -I../O.Common -I. -I. -I.. -I../../../../../../src/template/base/top/caServerApp -I../../../../../../include/compiler/msvc -I../../../../../../include/os/WIN32 -I../../../../../../include        -c ../../../../../../src/template/base/top/caServerApp/exAsyncPV.cc
exAsyncPV.cc
c:\jenkins64-1\workspace\epics-base-3.15-win64\include\aitHelpers.h(326) : warning C4267: 'initializing' : conversion from 'size_t' to 'unsigned int', possible loss of data
c:\jenkins64-1\workspace\epics-base-3.15-win64\include\aitHelpers.h(353) : warning C4267: 'initializing' : conversion from 'size_t' to 'unsigned int', possible loss of data
c:\jenkins64-1\workspace\epics-base-3.15-win64\include\aitHelpers.h(381) : warning C4267: 'initializing' : conversion from 'size_t' to 'unsigned int', possible loss of data
c:\jenkins64-1\workspace\epics-base-3.15-win64\include\aitHelpers.h(399) : warning C4267: 'argument' : conversion from 'size_t' to 'unsigned int', possible loss of data
c:\jenkins64-1\workspace\epics-base-3.15-win64\include\aitHelpers.h(439) : warning C4267: 'initializing' : conversion from 'size_t' to 'unsigned int', possible loss of data
cl -EHsc -GR             /favor:blend   -nologo -D__STDC__=0 -D_CRT_SECURE_NO_DEPRECATE -D_CRT_NONSTDC_NO_DEPRECATE   -Ox -GL   -W3 -w44355        -MT  -TP  -I. -I../O.Common -I. -I. -I.. -I../../../../../../src/template/base/top/caServerApp -I../../../../../../include/compiler/msvc -I../../../../../../include/os/WIN32 -I../../../../../../include        -c ../../../../../../src/template/base/top/caServerApp/exChannel.cc
exChannel.cc
c:\jenkins64-1\workspace\epics-base-3.15-win64\include\aitHelpers.h(326) : warning C4267: 'initializing' : conversion from 'size_t' to 'unsigned int', possible loss of data
c:\jenkins64-1\workspace\epics-base-3.15-win64\include\aitHelpers.h(353) : warning C4267: 'initializing' : conversion from 'size_t' to 'unsigned int', possible loss of data
c:\jenkins64-1\workspace\epics-base-3.15-win64\include\aitHelpers.h(381) : warning C4267: 'initializing' : conversion from 'size_t' to 'unsigned int', possible loss of data
c:\jenkins64-1\workspace\epics-base-3.15-win64\include\aitHelpers.h(399) : warning C4267: 'argument' : conversion from 'size_t' to 'unsigned int', possible loss of data
c:\jenkins64-1\workspace\epics-base-3.15-win64\include\aitHelpers.h(439) : warning C4267: 'initializing' : conversion from 'size_t' to 'unsigned int', possible loss of data
link -nologo  -LTCG -incremental:no -opt:ref -release -version:3.15 /MACHINE:X64              -out:excas.exe       main.obj exServer.obj exPV.obj exVectorPV.obj exScalarPV.obj exAsyncPV.obj exChannel.obj      ../../../../../../lib/windows-x64-static/cas.lib  ../../../../../../lib/windows-x64-static/gdd.lib  ../../../../../../lib/windows-x64-static/ca.lib  ../../../../../../lib/windows-x64-static/Com.lib ws2_32.lib advapi32.lib user32.lib ws2_32.lib advapi32.lib user32.lib kernel32.lib winmm.lib     
Generating code
Finished generating code
make[3]: Leaving directory `C:/jenkins64-1/workspace/epics-base-3.15-win64/src/ca/legacy/pcas/ex/O.windows-x64-static'
make[2]: Leaving directory `C:/jenkins64-1/workspace/epics-base-3.15-win64/src/ca/legacy/pcas/ex'
make -C ca/client/perl windows-x64-static 
make[2]: Entering directory `C:/jenkins64-1/workspace/epics-base-3.15-win64/src/ca/client/perl'
perl -CSD ../../../../bin/windows-x64/makeMakefile.pl O.windows-x64-static ../../../../..
make -C O.windows-x64 -f ../Makefile TOP=../../../../.. T_A=windows-x64
make[3]: Entering directory `C:/jenkins64-1/workspace/epics-base-3.15-win64/src/ca/client/perl/O.windows-x64'
make[3]: Nothing to be done for `all'.
make[3]: Leaving directory `C:/jenkins64-1/workspace/epics-base-3.15-win64/src/ca/client/perl/O.windows-x64'
make -C O.windows-x64-static -f ../Makefile TOP=../../../../.. T_A=windows-x64-static
make[3]: Entering directory `C:/jenkins64-1/workspace/epics-base-3.15-win64/src/ca/client/perl/O.windows-x64-static'
make[3]: Nothing to be done for `all'.
make[3]: Leaving directory `C:/jenkins64-1/workspace/epics-base-3.15-win64/src/ca/client/perl/O.windows-x64-static'
make[2]: Leaving directory `C:/jenkins64-1/workspace/epics-base-3.15-win64/src/ca/client/perl'
make -C ioc/db/test windows-x64-static 
make[2]: Entering directory `C:/jenkins64-1/workspace/epics-base-3.15-win64/src/ioc/db/test'
perl -CSD ../../../../bin/windows-x64/makeMakefile.pl O.windows-x64-static ../../../../..
make -C O.windows-x64 -f ../Makefile TOP=../../../../.. T_A=windows-x64
make[3]: Entering directory `C:/jenkins64-1/workspace/epics-base-3.15-win64/src/ioc/db/test/O.windows-x64'
make[3]: Nothing to be done for `all'.
make[3]: Leaving directory `C:/jenkins64-1/workspace/epics-base-3.15-win64/src/ioc/db/test/O.windows-x64'
make -C O.windows-x64-static -f ../Makefile TOP=../../../../.. T_A=windows-x64-static
make[3]: Entering directory `C:/jenkins64-1/workspace/epics-base-3.15-win64/src/ioc/db/test/O.windows-x64-static'
perl -CSD ../../../../../bin/windows-x64/mkmf.pl  -m xRecord.d . ../O.Common . . .. ../../../../../include/compiler/msvc ../../../../../include/os/WIN32 ../../../../../include        xRecord.d ../xRecord.c
perl -CSD ../../../../../bin/windows-x64/registerRecordDeviceDriver.pl  -I. -I.. -I../O.Common -I../../../../../dbd   -o arrShorthandTest_registerRecordDeviceDriver.cpp ../O.Common/arrShorthandTest.dbd arrShorthandTest_registerRecordDeviceDriver C:/jenkins64-1/workspace/epics-base-3.15-win64
perl -CSD ../../../../../bin/windows-x64/mkmf.pl  -m arrShorthandTest_registerRecordDeviceDriver.d . ../O.Common . . .. ../../../../../include/compiler/msvc ../../../../../include/os/WIN32 ../../../../../include        arrShorthandTest_registerRecordDeviceDriver.d arrShorthandTest_registerRecordDeviceDriver.cpp
perl -CSD ../../../../../bin/windows-x64/mkmf.pl  -m arrShorthandTest.d . ../O.Common . . .. ../../../../../include/compiler/msvc ../../../../../include/os/WIN32 ../../../../../include        arrShorthandTest.d ../arrShorthandTest.c
perl -CSD ../../../../../bin/windows-x64/registerRecordDeviceDriver.pl  -I. -I.. -I../O.Common -I../../../../../dbd   -o chfPluginTest_registerRecordDeviceDriver.cpp ../O.Common/chfPluginTest.dbd chfPluginTest_registerRecordDeviceDriver C:/jenkins64-1/workspace/epics-base-3.15-win64
perl -CSD ../../../../../bin/windows-x64/mkmf.pl  -m chfPluginTest_registerRecordDeviceDriver.d . ../O.Common . . .. ../../../../../include/compiler/msvc ../../../../../include/os/WIN32 ../../../../../include        chfPluginTest_registerRecordDeviceDriver.d chfPluginTest_registerRecordDeviceDriver.cpp
perl -CSD ../../../../../bin/windows-x64/mkmf.pl  -m chfPluginTest.d . ../O.Common . . .. ../../../../../include/compiler/msvc ../../../../../include/os/WIN32 ../../../../../include        chfPluginTest.d ../chfPluginTest.c
perl -CSD ../../../../../bin/windows-x64/registerRecordDeviceDriver.pl  -I. -I.. -I../O.Common -I../../../../../dbd   -o dbChannelTest_registerRecordDeviceDriver.cpp ../O.Common/dbChannelTest.dbd dbChannelTest_registerRecordDeviceDriver C:/jenkins64-1/workspace/epics-base-3.15-win64
perl -CSD ../../../../../bin/windows-x64/mkmf.pl  -m dbChannelTest_registerRecordDeviceDriver.d . ../O.Common . . .. ../../../../../include/compiler/msvc ../../../../../include/os/WIN32 ../../../../../include        dbChannelTest_registerRecordDeviceDriver.d dbChannelTest_registerRecordDeviceDriver.cpp
perl -CSD ../../../../../bin/windows-x64/mkmf.pl  -m dbChannelTest.d . ../O.Common . . .. ../../../../../include/compiler/msvc ../../../../../include/os/WIN32 ../../../../../include        dbChannelTest.d ../dbChannelTest.c
perl -CSD ../../../../../bin/windows-x64/mkmf.pl  -m dbStateTest.d . ../O.Common . . .. ../../../../../include/compiler/msvc ../../../../../include/os/WIN32 ../../../../../include        dbStateTest.d ../dbStateTest.c
perl -CSD ../../../../../bin/windows-x64/mkmf.pl  -m callbackTest.d . ../O.Common . . .. ../../../../../include/compiler/msvc ../../../../../include/os/WIN32 ../../../../../include        callbackTest.d ../callbackTest.c
make[3]: Leaving directory `C:/jenkins64-1/workspace/epics-base-3.15-win64/src/ioc/db/test/O.windows-x64-static'
make[3]: Entering directory `C:/jenkins64-1/workspace/epics-base-3.15-win64/src/ioc/db/test/O.windows-x64-static'
cl             /favor:blend   -nologo -D__STDC__=0 -D_CRT_SECURE_NO_DEPRECATE -D_CRT_NONSTDC_NO_DEPRECATE   -Ox -GL   -W3 -w44355        -MT    -I. -I../O.Common -I. -I. -I.. -I../../../../../include/compiler/msvc -I../../../../../include/os/WIN32 -I../../../../../include        -c ../xRecord.c
xRecord.c
../O.Common\xRecord.h(29) : warning C4244: '=' : conversion from '__int64' to 'short', possible loss of data
../O.Common\xRecord.h(30) : warning C4244: '=' : conversion from '__int64' to 'short', possible loss of data
lib -nologo -verbose -out:xRec.lib -LTCG       xRecord.obj 
Appending xRecord.obj
cl             /favor:blend   -nologo -D__STDC__=0 -D_CRT_SECURE_NO_DEPRECATE -D_CRT_NONSTDC_NO_DEPRECATE   -Ox -GL   -W3 -w44355        -MT    -I. -I../O.Common -I. -I. -I.. -I../../../../../include/compiler/msvc -I../../../../../include/os/WIN32 -I../../../../../include        -c ../callbackTest.c
callbackTest.c
link -nologo  -LTCG -incremental:no -opt:ref -release -version:3.15 /MACHINE:X64              -out:callbackTest.exe       callbackTest.obj      ./xRec.lib  ../../../../../lib/windows-x64-static/dbCore.lib  ../../../../../lib/windows-x64-static/ca.lib  ../../../../../lib/windows-x64-static/Com.lib  ws2_32.lib advapi32.lib user32.lib kernel32.lib winmm.lib     
Generating code
Finished generating code
cl             /favor:blend   -nologo -D__STDC__=0 -D_CRT_SECURE_NO_DEPRECATE -D_CRT_NONSTDC_NO_DEPRECATE   -Ox -GL   -W3 -w44355        -MT    -I. -I../O.Common -I. -I. -I.. -I../../../../../include/compiler/msvc -I../../../../../include/os/WIN32 -I../../../../../include        -c ../dbStateTest.c
dbStateTest.c
link -nologo  -LTCG -incremental:no -opt:ref -release -version:3.15 /MACHINE:X64              -out:dbStateTest.exe       dbStateTest.obj      ./xRec.lib  ../../../../../lib/windows-x64-static/dbCore.lib  ../../../../../lib/windows-x64-static/ca.lib  ../../../../../lib/windows-x64-static/Com.lib  ws2_32.lib advapi32.lib user32.lib kernel32.lib winmm.lib     
Generating code
Finished generating code
cl             /favor:blend   -nologo -D__STDC__=0 -D_CRT_SECURE_NO_DEPRECATE -D_CRT_NONSTDC_NO_DEPRECATE   -Ox -GL   -W3 -w44355        -MT    -I. -I../O.Common -I. -I. -I.. -I../../../../../include/compiler/msvc -I../../../../../include/os/WIN32 -I../../../../../include        -c ../dbChannelTest.c
dbChannelTest.c
cl -EHsc -GR             /favor:blend   -nologo -D__STDC__=0 -D_CRT_SECURE_NO_DEPRECATE -D_CRT_NONSTDC_NO_DEPRECATE   -Ox -GL   -W3 -w44355        -MT  -TP  -I. -I../O.Common -I. -I. -I.. -I../../../../../include/compiler/msvc -I../../../../../include/os/WIN32 -I../../../../../include        -c dbChannelTest_registerRecordDeviceDriver.cpp
dbChannelTest_registerRecordDeviceDriver.cpp
link -nologo  -LTCG -incremental:no -opt:ref -release -version:3.15 /MACHINE:X64              -out:dbChannelTest.exe       dbChannelTest.obj dbChannelTest_registerRecordDeviceDriver.obj      ./xRec.lib  ../../../../../lib/windows-x64-static/dbCore.lib  ../../../../../lib/windows-x64-static/ca.lib  ../../../../../lib/windows-x64-static/Com.lib  ws2_32.lib advapi32.lib user32.lib kernel32.lib winmm.lib     
Generating code
c:\jenkins64-1\workspace\epics-base-3.15-win64\src\ioc\rsrv\online_notify.c(300) : fatal error C1001: An internal error has occurred in the compiler.
(compiler file 'f:\dd\vctools\compiler\utc\src\p2\amd64\unwindmd.c', line 1101)
 To work around this problem, try simplifying or changing the program near the locations listed above.
Please choose the Technical Support command on the Visual C++ 
 Help menu, or open the Technical Support help file for more information
LINK : fatal error LNK1257: code generation failed
make[3]: *** [dbChannelTest.exe] Error 1257
make[3]: Leaving directory `C:/jenkins64-1/workspace/epics-base-3.15-win64/src/ioc/db/test/O.windows-x64-static'
make[2]: *** [windows-x64-static] Error 2
make[2]: Leaving directory `C:/jenkins64-1/workspace/epics-base-3.15-win64/src/ioc/db/test'
make[1]: *** [ioc/db/test.windows-x64-static] Error 2
make[1]: Leaving directory `C:/jenkins64-1/workspace/epics-base-3.15-win64/src'
make: *** [src.windows-x64-static] Error 2

<https://jenkins.aps.anl.gov/job/epics-base-3.15-win64s/ws/>exit> 2 
Build step 'Execute Windows batch command' marked build as failure
[WARNINGS] Skipping publisher since build result is FAILURE

Replies:
Jenkins build is back to normal : epics-base-3.15-win64s #2 APS Jenkins

Navigate by Date:
Prev: Re: epicsStr[n]CaseCmp() Benjamin Franksen
Next: Jenkins build is back to normal : epics-base-3.15-win64s #2 APS Jenkins
Index: 2002  2003  2004  2005  2006  2007  2008  2009  2010  2011  2012  2013  <20142015  2016  2017 
Navigate by Thread:
Prev: Re: epicsStr[n]CaseCmp() Benjamin Franksen
Next: Jenkins build is back to normal : epics-base-3.15-win64s #2 APS Jenkins
Index: 2002  2003  2004  2005  2006  2007  2008  2009  2010  2011  2012  2013  <20142015  2016  2017 
ANJ, 16 May 2014 Valid HTML 4.01! · Home · News · About · Base · Modules · Extensions · Distributions · Download ·
· EPICS V4 · IRMIS · Talk · Bugs · Documents · Links · Licensing ·